program: Gaussian 09
title: 000253309
version: EM64L-G09RevD.01
frameworkgroup: C1[X(C10H9NO2)]
method: RPBEPBE
basis: SDD
operation: Freq
keyword: #p
keyword: freq=noraman
keyword: PBEPBE/SDD
title: #p freq=noraman PBEPBE/SDD
converged: NO YES NO NO
title: Mulliken charges:
elementType: O O N C C C C C C C C C C H H H H H H H H H
charge: -0.257515 -0.270591 -0.400359 0.181799 0.321249 -0.504984 -0.385953 0.327983 0.118493 -0.336243 -0.295943 -0.214627 -0.536538 0.301609 0.222595 0.312052 0.245073 0.247963 0.236726 0.249611 0.218800 0.218800
chargesum: 0.00000
title: Mulliken charges with hydrogens summed into heavy atoms:
elementType: O O N C C C C C C C C C C
charge: -0.257515 -0.270591 -0.088307 0.181799 0.321249 -0.203375 -0.163358 0.327983 0.118493 -0.091170 -0.047980 0.022099 0.150674
polarizability: 1.86516501e+02 2.44414524e+00 1.37048137e+02 -6.40918732e-03 -5.91657650e-04 5.30292095e+01
1716.lowfreq: -8.0428 -0.0006 0.0009 0.0010 2.4519 4.1948 72.2532 102.7028 167.9856
frequency: 72.2519 102.7025 167.9856 178.2776 184.5250 233.3325 273.3882 332.3569 370.4097 419.5874 462.8986 509.0671 515.0717 521.6053 552.9029 555.9491 582.0722 681.6086 687.2527 715.9658 759.5077 802.0215 827.8179 859.4857 882.4521 920.3156 940.3637 943.1697 996.9916 1042.3633 1070.8174 1111.0548 1139.9085 1164.4665 1178.6451 1216.7971 1246.4758 1272.6612 1293.4463 1386.6847 1390.0014 1425.2520 1435.2572 1466.5322 1470.7253 1484.2798 1496.8243 1551.8466 1580.9385 1619.2123 1640.9909 2953.9601 3040.8852 3119.0990 3126.0477 3159.8344 3165.1115 3166.4671 3189.4767 3562.9467
redmass: 3.3929 4.9407 3.4706 4.5819 4.2217 1.2346 4.4831 4.1941 6.8672 3.2881 5.3920 4.4665 7.7151 5.6574 5.1605 2.8851 1.1911 5.9053 3.5391 6.2691 2.3731 1.5346 2.0393 5.6225 5.2388 1.4038 1.4044 1.3029 4.6094 2.6218 2.3162 1.2577 1.4046 1.2645 1.8702 1.8611 1.7069 2.3943 1.9259 3.4342 2.5036 4.4346 1.2067 1.0506 1.1137 2.2634 3.9953 7.6431 4.0872 6.4774 6.5172 1.0334 1.1039 1.0897 1.0987 1.0891 1.0936 1.0922 1.0980 1.0780
irintensity: 7.2341 0.0477 0.0392 2.6718 0.7269 0.0190 9.3406 12.6200 2.2179 3.1685 3.1719 2.4983 5.6805 2.3290 9.4170 21.1971 73.9856 18.3311 6.1408 2.4497 14.6044 44.5760 65.4322 11.1451 2.7566 2.1247 10.0639 7.3551 62.0134 8.3704 11.2934 0.1608 11.5114 10.2241 45.4950 99.8843 3.8631 139.6040 1.6905 16.9845 7.6746 13.0844 11.5634 13.8689 99.2276 84.0987 152.8278 133.7884 78.0999 176.0329 31.0235 77.2752 51.9164 18.0818 18.9307 6.3616 7.5651 11.7073 9.2745 54.3489
temp: 298.150 k
press: 1.00000 atm
elementType: 8 8 7 6 6 6 6 6 6 6 6 6 6 1 1 1 1 1 1 1 1 1
symmnumber: 1
zpe: 443936.3 jmol-1
zpe.correction: 0.169086 hartree
zpe.thermalcorrener: 0.179786 hartree
zpe.thermalcorrenthalpy: 0.180730 hartree
zpe.thermalcorrgfe: 0.132774 hartree
zpe.sumelectzpe: -590.739050 hartree
zpe.sumelectthermal: -590.728350 hartree
zpe.sumelectthermalent: -590.727406 hartree
zpe.sumelectthermalfe: -590.775362 hartree
dipole: -1.4996 -7.8116 0.0002
dipole: 7.9542
quadrupole: -54.5775 -76.5312 -79.3174
quadrupole: -9.1703 -0.0009 0.0018
quadrupole: 15.5645 -6.3892 -9.1754 -9.1703 -0.0009 0.0018
hfenergy: -590.9081361 hartree
pointgroup: C01 [X(C10H9N1O2)]
dipole: 0.6289437 3.0655881 0.000093 debye
dipolederiv: -1.836452 0.159868 -0.0000523 0.5133766 -0.3269552 0.0000181 -0.0000493 0.0000015 -0.29779 -0.4725107 0.0234853 -0.000013 -0.2303517 -1.2188881 0.0000564 -0.0000224 -0.0001503 -0.3689283 -0.9437587 -0.2783058 -0.0000316 0.0044482 -0.6130797 0.0000055 -0.0000803 -0.0000783 -0.2559405 -0.1315388 -0.4057349 -0.0000099 -0.1700284 -0.151579 -0.0000114 0.0000383 -0.000003 -0.0181778 0.5565685 -0.2723688 0.0000212 -0.2448496 -0.0216225 -0.0000377 0.0000736 0.0000174 0.0459754 -0.4151591 0.277243 -0.0000223 -0.1791364 0.0314002 -0.0000203 -0.0000007 0.0000002 -0.1232301 -0.0344245 0.2445554 -0.0000012 -0.0767928 0.1357784 -0.0000061 0.0000079 -0.0000005 -0.1707857 1.4134476 -0.4770906 0.0000448 -0.8546312 0.0273307 -0.0000262 0.0000451 0.0000034 0.0805364 0.6713568 -0.1559853 0.0000519 0.280522 1.3225158 -0.0000148 -0.0000027 0.000066 0.1614088 -0.1758191 -0.1159853 -0.000001 0.398206 0.0719913 0.0000092 -0.0000108 -0.0000128 -0.1853207 -0.1147563 0.484176 0.0000169 -0.0809865 -0.5893595 0.000003 -0.0000025 0.0000481 -0.2461989 0.464141 0.43604 0.0000564 0.4611373 0.8167895 -0.0000104 0.0000614 0.0000679 -0.0655032 0.8954475 0.046835 0.0000181 0.3660751 0.2402945 0.0000131 0.000009 0.0000015 0.3345912 0.1350263 -0.0200178 0. 0.06033 0.0519464 0.0000094 0.0000033 -0.0000016 0.164711 0.0612678 0.0616839 -0.0000049 0.0209684 -0.1185984 0.000007 -0.0000145 0.0000163 0.1675106 0.1519337 -0.0644114 -0.0000128 -0.0140914 0.1981726 0.000004 -0.000013 -0.0000004 0.3277108 -0.0478716 -0.0904569 -0.0000045 -0.0935689 0.0597307 -0.0000004 0.0000008 -0.000002 0.1632562 -0.0452184 -0.034765 -0.0000239 -0.0695447 0.0626818 -0.0000013 -0.0000329 -0.0000112 0.1759912 -0.0364261 0.0762539 -0.0000286 0.1101505 0.028507 0.0000103 -0.0000119 0.0000359 0.172942 -0.0837985 0.0836735 -0.0000073 0.1405377 0.0087786 0.0000057 -0.0000078 0.0000038 0.1241847 -0.0057272 0.0106567 0.0203752 -0.1708831 -0.007921 -0.1247185 -0.0499189 -0.1065021 -0.0934694 -0.0057283 0.010651 -0.0203712 -0.1708872 -0.0079144 0.1247054 0.0499281 0.1065001 -0.0934736 unknown
polarizability: 186.5705599|1.8156818|136.9940773|0.0064162|0.0005103|53.0292095 unknown
InChI: InChI=1S/C10H9NO2/c1-13-7-2-3-9-8(6-7)10(12)4-5-11-9/h2-6,11H,1H3
charge 0 multiplicity 1
22 atoms
O  3.115907 -0.917208 0.000252
O  -1.727699 -2.465452 -0.000122
N  -1.878773 1.695359 0.000044
C  -0.535686 -0.346749 0.000158
C  -0.613692 1.082576 0.000122
C  0.733579 -0.966069 0.000198
C  0.573766 1.85714 0.00014
C  1.91186 -0.195322 0.00021
C  -1.77651 -1.187019 0.000205
C  1.830686 1.228648 0.000183
C  -3.029117 -0.430279 -0.000039
C  -3.045445 0.95148 -0.00006
C  4.367749 -0.157227 0.000274
H  0.781083 -2.059475 0.000238
H  0.515959 2.952853 0.00011
H  -1.927224 2.714584 0.000016
H  2.733793 1.845685 0.000193
H  -3.968528 -0.988703 -0.000175
H  -3.977456 1.524041 -0.000189
H  5.162536 -0.917206 0.000306
H  4.457832 0.474884 0.905916
H  4.45788 0.474859 -0.905381
