program: Gaussian 09
title: 000253308
version: EM64L-G09RevD.01
frameworkgroup: C1[X(C8H11NO)]
method: RPBEPBE
basis: SDD
operation: Freq
keyword: #p
keyword: freq=noraman
keyword: PBEPBE/SDD
title: #p freq=noraman PBEPBE/SDD
converged: NO NO NO NO
title: Mulliken charges:
elementType: O N C C C C C C C C H H H H H H H H H H H
charge: -0.288152 -0.039838 0.054450 -0.324377 0.146444 -0.331333 -0.305618 -0.167414 -0.786792 -0.490567 0.217864 0.217725 0.283791 0.234084 0.234153 0.251011 0.226673 0.226666 0.203869 0.203848 0.233513
chargesum: 0.00000
title: Mulliken charges with hydrogens summed into heavy atoms:
elementType: O N C C C C C C C C
charge: -0.288152 -0.039838 0.054450 0.111213 0.146444 -0.047543 -0.071534 0.066738 -0.082442 0.150662
polarizability: 1.30990587e+02 -8.10303462e-01 9.74667350e+01 2.05560812e-02 9.82664936e-03 5.39609481e+01
1716.lowfreq: -0.0008 -0.0006 -0.0006 4.0907 5.9506 11.5917 48.3177 61.1546 80.7509
frequency: 47.8762 61.1070 80.5767 134.0753 185.1797 208.0540 228.7364 293.1799 324.4861 423.3648 429.8293 537.1202 544.6211 612.0157 738.0623 742.2897 792.1241 882.7049 921.7741 927.2477 962.3302 997.3387 997.4699 1014.0737 1047.9585 1074.4289 1082.6326 1117.4978 1154.2204 1169.3759 1191.4421 1231.5833 1272.4344 1320.4617 1344.3992 1388.2153 1404.8528 1437.3964 1448.3545 1459.1408 1459.4540 1466.6092 1471.7515 1477.8437 1575.3390 1584.4443 2920.7772 2928.7492 2971.8424 2978.0508 2998.3698 3054.7327 3100.7761 3109.5673 3127.8145 3150.2175 3186.1298
redmass: 1.0365 2.8323 2.4222 3.5082 3.0210 3.0384 1.1971 3.2718 3.7281 3.6583 3.5002 5.1209 2.9329 5.8923 4.7655 3.1388 1.2527 4.4713 1.3093 2.7919 6.6863 1.4265 1.8944 1.6582 1.5880 4.6573 1.5915 1.2742 1.4432 1.1628 1.0807 1.9331 3.1967 5.5314 1.7817 1.2731 2.2350 1.2371 2.0313 1.1253 1.0507 1.1562 1.0467 1.0719 6.6099 5.5516 1.0436 1.0455 1.1041 1.0384 1.1029 1.0972 1.0971 1.0977 1.0878 1.0967 1.0956
irintensity: 0.3022 0.0017 13.8360 5.1310 0.0855 7.3814 8.0507 2.5019 0.4687 4.5659 0.0569 2.4822 0.2599 1.2831 0.2868 4.8644 58.7120 12.1433 0.5322 9.0979 0.5621 1.4496 17.3570 2.1856 8.3490 106.1396 29.5306 0.0194 20.7554 4.6165 3.5548 1.6260 1.8937 8.2203 7.6321 11.7584 17.7886 13.0157 69.6509 10.9082 12.4622 19.5113 14.9827 8.6526 54.9866 42.8095 51.5543 83.1430 47.4197 23.1242 69.5099 21.6509 30.2266 10.8475 8.6891 22.3817 2.6161
temp: 298.150 k
press: 1.00000 atm
elementType: 8 7 6 6 6 6 6 6 6 6 1 1 1 1 1 1 1 1 1 1 1
symmnumber: 1
zpe: 453339.8 jmol-1
zpe.correction: 0.172668 hartree
zpe.thermalcorrener: 0.183036 hartree
zpe.thermalcorrenthalpy: 0.183980 hartree
zpe.thermalcorrgfe: 0.135945 hartree
zpe.sumelectzpe: -440.647394 hartree
zpe.sumelectthermal: -440.637026 hartree
zpe.sumelectthermalent: -440.636082 hartree
zpe.sumelectthermalfe: -440.684117 hartree
dipole: -0.2813 0.2185 0.0039
dipole: 0.3562
quadrupole: -45.6571 -57.8138 -62.0443
quadrupole: 5.0617 -0.0055 0.0021
quadrupole: 9.5146 -2.6421 -6.8725 5.0617 -0.0055 0.0021
hfenergy: -440.8200622 hartree
pointgroup: C01 [X(C8H11N1O1)]
dipole: 0.0998828 -0.09375 -0.029592 debye
dipolederiv: -1.1793508 0.0679518 -0.0188747 0.1821861 -0.4130686 0.0202715 0.0265544 0.0129517 -0.4287061 -0.6694416 0.0785681 0.0053735 0.0605491 -0.3418156 -0.0369111 -0.0016897 -0.0359328 -0.2540734 0.6134569 0.0732792 0.0652131 0.3384469 0.1612813 0.0801906 0.1703126 0.064393 0.0463546 0.4562486 -0.1566463 -0.058987 -0.4919009 0.3466451 -0.0549001 -0.1922265 -0.0341642 0.3829828 0.4311968 -0.2215356 -0.0637558 -0.3860273 0.3997066 0.1258494 -0.1289788 0.1355308 0.0711379 -0.2899128 -0.0662307 -0.036182 -0.2825709 -0.1680591 -0.0344784 -0.1219437 -0.0217069 -0.1397406 -0.0850252 0.0512406 0.0246369 0.2776194 -0.3182308 -0.0468425 0.1145998 -0.060314 -0.1757933 0.2314404 0.0104852 0.0251167 -0.006218 0.1593405 0.1112377 0.0184927 0.1122596 -0.0759437 -0.1791338 0.1729845 0.0546135 0.1246401 -0.0585812 -0.0382253 0.0353042 -0.0352413 0.0444888 0.8107519 0.0403447 0.0424254 0.1671901 0.266757 -0.0363928 0.0931601 -0.0442075 0.3724919 -0.0551346 -0.0489303 0.0334954 0.0371049 -0.1172985 0.0789502 0.0547335 0.1096465 0.0051299 -0.0454567 -0.0005936 -0.0494523 0.0727553 0.0316645 -0.0418892 -0.0074878 -0.082389 -0.1531092 0.0898776 0.075538 0.0253314 0.1111035 0.0589908 -0.0369944 0.0393679 -0.0391081 0.155858 -0.1166337 -0.0386104 -0.0318054 -0.040187 0.0999828 -0.0265622 -0.0324265 -0.0264647 0.1483489 0.069075 -0.0441069 -0.0219721 -0.0502532 -0.0720178 -0.0886379 -0.0243594 -0.0882199 0.1070846 0.0763951 -0.1139057 -0.0475792 -0.0212195 -0.0415838 -0.0636989 -0.0107388 -0.0692173 0.0874056 0.012427 0.0710959 -0.0825347 0.0694903 0.0520247 0.0040247 -0.115153 0.0562757 -0.0534371 -0.0143982 -0.005783 0.1139378 -0.0346557 0.0340404 0.0691608 0.1344891 0.0186935 -0.0085838 -0.042724 -0.0019156 -0.0103729 -0.0912124 0.0691937 -0.0654452 -0.1352218 -0.043425 -0.20761 -0.0554706 -0.0251235 0.0092771 -0.1773714 -0.1081795 0.1338125 0.0378574 0.1267118 -0.0174995 -0.0581873 0.0818936 0.0220951 0.1405307 -0.0407925 -0.0525195 0.0453542 -0.0560719 0.0932139 unknown
polarizability: 130.1317163|-5.8324827|92.2852731|2.249983|14.8702229|60.0012812 unknown
InChI: InChI=1S/C8H11NO/c1-7-4-3-5-8(9-7)6-10-2/h3-5H,6H2,1-2H3
charge 0 multiplicity 1
21 atoms
O  2.721012 -0.55236 -0.072391
N  -0.59198 0.97608 0.335222
C  0.373236 0.054512 0.026502
C  1.791557 0.516088 0.294847
C  -1.903347 0.649442 0.127603
C  0.080687 -1.223398 -0.498341
C  -2.280548 -0.617618 -0.398086
C  -1.277134 -1.558789 -0.712477
C  -2.940223 1.695818 0.481378
C  4.11121 -0.174233 0.164795
H  1.994779 1.437449 -0.294912
H  1.894226 0.776941 1.371611
H  0.898501 -1.911704 -0.722605
H  -3.340109 -0.849708 -0.553095
H  -1.545378 -2.54086 -1.118505
H  -2.441738 2.598044 0.869478
H  -3.543866 1.980598 -0.40137
H  -3.64271 1.324088 1.25147
H  4.298894 0.045063 1.238139
H  4.403245 0.713007 -0.43758
H  4.722486 -1.03796 -0.141384
