program: Gaussian 09
title: 000253307
version: EM64L-G09RevD.01
frameworkgroup: C1[X(C8H9N)]
method: RPBEPBE
basis: SDD
operation: Freq
keyword: #p
keyword: freq=noraman
keyword: PBEPBE/SDD
title: #p freq=noraman PBEPBE/SDD
converged: NO YES NO NO
title: Mulliken charges:
elementType: N C C C C C C C C H H H H H H H H H
charge: -0.020067 -0.260402 -0.206536 -0.512135 -0.144044 -0.484149 -0.218271 -0.217362 -0.197977 0.266340 0.247939 0.254531 0.239719 0.276609 0.233268 0.251917 0.246412 0.244207
chargesum: 0.00000
title: Mulliken charges with hydrogens summed into heavy atoms:
elementType: N C C C C C C C C
charge: -0.020067 0.005937 0.041402 -0.017885 0.132565 0.001037 0.028141 0.026845 -0.197977
polarizability: 1.00255314e+02 2.06496712e+00 7.45663529e+01 -5.53913138e+00 1.06033181e+00 6.49748168e+01
1716.lowfreq: -20.5149 0.0001 0.0003 0.0008 13.2004 16.2033 106.3945 152.9755 280.8260
frequency: 106.2177 152.9632 280.8151 352.3659 430.1426 459.3097 517.7694 549.9321 665.0844 712.4035 764.7529 773.7307 826.2391 854.1446 901.2684 902.4766 917.6135 933.3532 941.2714 991.5266 992.1329 1018.8302 1046.0030 1091.9380 1105.5077 1129.1252 1149.5401 1177.6609 1230.0295 1250.2697 1261.8329 1264.8088 1278.1114 1306.0168 1324.9548 1464.9901 1477.8286 1581.9381 2178.1775 3019.2449 3027.6639 3035.1252 3088.1928 3096.6516 3100.0390 3103.9581 3158.2371 3190.7354
redmass: 4.4868 5.6926 3.5146 2.5324 4.5338 2.4861 3.2414 3.8431 3.6141 1.5849 5.0280 3.8985 2.6139 2.4743 2.3722 2.9191 1.8244 1.5138 2.8602 1.6771 2.1300 1.7691 2.0239 1.2496 1.1090 1.1926 1.5440 1.3728 1.3024 1.5524 1.3796 1.5220 1.3960 1.4802 1.7255 1.0856 1.1015 5.7067 12.5279 1.0607 1.0617 1.0831 1.0902 1.1043 1.0996 1.0991 1.0876 1.1097
irintensity: 3.6405 3.6842 0.2626 2.5263 0.8397 1.8645 1.0385 0.6487 3.7008 58.0032 0.1056 7.8389 13.6016 7.1530 2.4260 3.5765 3.6779 0.3566 3.4314 1.5658 2.3052 5.8124 2.6029 5.2018 0.2420 3.9940 0.9777 2.0014 1.4728 4.9384 0.9267 2.4033 2.1249 0.6018 14.0975 10.7778 5.9914 1.6652 26.2166 29.4730 21.4194 9.3312 42.9178 18.1354 26.1261 15.1886 5.6552 18.2955
temp: 298.150 k
press: 1.00000 atm
elementType: 7 6 6 6 6 6 6 6 6 1 1 1 1 1 1 1 1 1
symmnumber: 1
zpe: 389880.5 jmol-1
zpe.correction: 0.148498 hartree
zpe.thermalcorrener: 0.155585 hartree
zpe.thermalcorrenthalpy: 0.156529 hartree
zpe.thermalcorrgfe: 0.117057 hartree
zpe.sumelectzpe: -364.293790 hartree
zpe.sumelectthermal: -364.286703 hartree
zpe.sumelectthermalent: -364.285758 hartree
zpe.sumelectthermalfe: -364.325231 hartree
dipole: 4.0537 0.3227 -0.9684
dipole: 4.1802
quadrupole: -69.2420 -49.9845 -51.4530
quadrupole: 0.5634 0.7256 0.8980
quadrupole: -12.3488 6.9087 5.4402 0.5634 0.7256 0.8980
hfenergy: -364.4422878 hartree
pointgroup: C01 [X(C8H9N1)]
dipole: 1.5912864 -0.1405705 0.3909562 debye
dipolederiv: -0.43766 0.026809 0.0317737 0.0244315 -0.2321714 0.0015181 -0.0882669 0.0121497 -0.2257815 0.1327321 -0.0218191 -0.0858962 0.0238796 0.1373669 -0.0632329 -0.1151476 -0.1007482 0.0544898 0.0427419 -0.0716618 -0.0953979 0.0179718 0.1200816 0.0310129 -0.0773544 0.0972872 0.0641262 0.0707796 0.0857523 0.0191505 0.0730434 -0.0596125 -0.0061406 0.0213489 -0.0045033 0.0402328 -0.1069621 0.0337836 -0.0145176 0.0310819 0.0975891 0.0315261 -0.0502311 0.038885 0.1731496 0.0208427 -0.0098903 0.0301563 -0.08382 0.0188805 -0.023071 0.0147513 -0.06007 0.0920542 0.0001822 0.0019741 0.1484058 -0.0656689 -0.1080383 0.0910256 0.1506924 0.1534675 -0.1477374 -0.0696698 0.0094874 0.157648 0.0323241 0.0420347 0.0739141 0.1876041 0.0215787 -0.1530995 0.3389013 -0.0233058 0.0442864 -0.074671 -0.0824541 -0.0067226 0.2189069 -0.0120892 -0.0607888 0.0180882 0.0830611 -0.0122124 0.0699479 -0.0892397 0.0381451 -0.0140909 0.0442727 0.0605722 0.0004948 0.0779387 0.0369835 0.0771354 -0.09541 -0.069217 0.0517689 -0.0794277 0.0418943 -0.0237517 -0.0505237 0.1246545 -0.0468494 0.0406695 0.0727253 0.0906435 0.0488977 -0.035985 -0.0605222 -0.0674916 -0.1282346 -0.0721714 0.0581133 -0.054536 -0.0910169 -0.0331487 0.0182547 0.0205279 0.0005834 0.0018225 0.0214326 0.0580359 -0.0427182 0.0157591 -0.0465723 -0.0577406 0.0307431 0.049417 -0.0338775 0.0328292 0.0304394 0.057582 -0.0180908 0.0988668 -0.1070134 -0.0228338 -0.1350688 -0.0392505 -0.080294 -0.0206136 -0.0324909 -0.0483326 -0.0549397 0.0497931 0.0682176 -0.0238347 -0.0696707 -0.0391876 0.0028101 -0.1050688 -0.0985318 -0.1199171 0.0890178 -0.0228518 0.0347891 -0.1158238 0.058585 0.0815188 0.0057488 -0.150412 -0.0039891 0.1045617 unknown
polarizability: 100.1489778|-2.2840975|74.5542876|5.7761097|1.1594878|65.0932184 unknown
InChI: InChI=1S/C8H9N/c9-5-8-4-6-1-2-7(8)3-6/h1-2,6-8H,3-4H2
charge 0 multiplicity 1
18 atoms
N  -3.192786 0.100446 -0.202033
C  0.266662 1.030365 -0.268348
C  1.265792 -1.012801 -0.418845
C  0.632444 0.023582 -1.399895
C  -0.664707 0.103677 0.64573
C  0.027998 -1.315677 0.512562
C  1.599776 1.119464 0.48289
C  2.200902 -0.102844 0.388271
C  -2.061554 0.097777 0.183854
H  -0.207403 1.979037 -0.55692
H  1.718662 -1.913444 -0.858913
H  1.364333 0.441111 -2.110186
H  -0.246986 -0.364033 -1.944777
H  -0.651074 0.463081 1.690014
H  0.32553 -1.714842 1.495578
H  -0.65038 -2.041184 0.031955
H  1.931435 1.984826 1.06249
H  3.124956 -0.42834 0.873772
