program: Gaussian 09
title: 000253361
version: EM64L-G09RevD.01
frameworkgroup: C1[X(C11H11N3O4S)]
method: RPBEPBE
basis: SDD
operation: Freq
keyword: #p
keyword: freq=noraman
keyword: PBEPBE/SDD
title: #p freq=noraman PBEPBE/SDD
converged: YES YES NO NO
title: Mulliken charges:
elementType: S O O O O N N N C C C C C C C C C C C H H H H H H H H H H H
charge: 0.889410 -0.562197 -0.503394 -0.245732 -0.154799 -0.118536 -0.018736 0.076398 -0.026869 -0.759185 0.532247 0.140944 -0.188246 -0.575736 -0.338969 -0.370716 -0.217938 -0.215292 -0.218391 0.303172 0.288645 0.276200 0.277696 0.281801 0.215732 0.283108 0.243517 0.236125 0.234133 0.235608
chargesum: 0.00000
title: Mulliken charges with hydrogens summed into heavy atoms:
elementType: S O O O O N N N C C C C C C C C C C C
charge: 0.889410 -0.562197 -0.503394 -0.245732 -0.154799 -0.118536 -0.018736 0.076398 -0.026869 -0.167368 0.532247 0.140944 0.087955 0.199493 -0.055861 -0.127198 0.018187 0.018841 0.017217
polarizability: 2.96044682e+02 -5.13315147e+00 1.96834216e+02 -8.08419047e+00 1.07614152e+01 1.03807023e+02
1716.lowfreq: -11.0423 -8.2161 -0.0005 0.0009 0.0010 3.3552 22.6054 27.3139 40.5606
frequency: 22.4828 27.2884 40.5377 48.3645 78.0856 82.8992 106.4727 120.2633 133.8286 160.0807 170.6487 187.2286 213.2839 242.7549 267.8224 287.1034 320.6498 358.5366 370.9206 388.3049 400.6442 411.5755 469.7580 504.7968 545.9720 568.5785 613.9081 617.8929 633.1805 679.9732 694.2823 725.5436 758.6852 775.4392 793.2884 808.3286 817.4899 853.6672 875.5380 929.5008 943.1144 950.8179 987.8716 988.1907 1006.6526 1025.3588 1039.5648 1064.9654 1065.9298 1114.8910 1122.9464 1172.7809 1177.2223 1183.2019 1196.3350 1222.3980 1247.7186 1286.6027 1292.1491 1334.6019 1340.6401 1375.4910 1392.4967 1418.7012 1431.8895 1437.6573 1445.0341 1450.7657 1468.8755 1480.6369 1484.1009 1583.7570 1609.1173 3025.6731 3074.5201 3128.8400 3129.4643 3137.4195 3141.3788 3150.4469 3161.5303 3172.7855 3179.7299 3242.9764
redmass: 7.8246 5.3047 8.3977 4.3295 4.9142 4.2347 1.5705 3.4876 8.0371 7.3763 6.6381 6.7253 9.9906 6.9270 5.9093 5.8966 5.8160 2.2703 4.3781 9.1170 2.8990 7.5960 10.6859 4.2955 7.1172 4.6177 6.2915 8.9240 3.9068 7.1293 1.6997 12.8127 12.2274 2.0364 9.5307 1.4486 4.2719 1.2621 1.9488 3.9374 1.4607 8.0128 1.4416 5.2423 1.3445 2.1904 3.0607 1.5329 2.2630 1.2158 1.3327 1.6740 1.0643 1.7825 1.1193 2.3056 2.7197 7.2233 3.7063 1.2751 7.4004 12.1056 8.7149 2.4694 5.7249 1.2206 2.2410 1.0402 1.3432 1.2302 2.3203 5.7416 5.8520 1.0333 1.0566 1.1032 1.0864 1.0888 1.1025 1.0923 1.0968 1.1014 1.1135 1.0995
irintensity: 5.1682 1.5631 0.8154 0.5695 4.0555 2.4450 0.4582 1.3185 4.6212 2.7428 19.9644 1.0033 2.4841 3.9758 0.8027 10.5792 26.7219 1.4826 5.5619 51.3551 4.6248 11.8865 86.3142 26.6995 2.8471 9.7951 0.6955 2.3738 14.4414 1.5236 53.9367 1.8974 35.4386 15.1275 73.6223 24.6357 9.4927 0.7107 18.2763 59.9887 4.2457 8.9090 0.0427 0.8479 0.0149 3.8703 7.0691 6.7536 6.2995 2.2278 1.3301 7.5238 0.8402 92.8225 1.1045 119.1523 58.4537 32.1981 0.7965 1.0275 52.7278 193.7726 3.9057 1.7617 60.5924 7.2127 13.2975 23.3638 25.7552 48.3832 1.2756 0.3979 27.9512 22.2675 5.2120 14.1073 0.6434 2.8128 4.4537 16.2415 13.5844 26.5214 2.3327 0.3567
temp: 298.150 k
press: 1.00000 atm
elementType: 16 8 8 8 8 7 7 7 6 6 6 6 6 6 6 6 6 6 6 1 1 1 1 1 1 1 1 1 1 1
symmnumber: 1
zpe: 556220.7 jmol-1
zpe.correction: 0.211853 hartree
zpe.thermalcorrener: 0.230344 hartree
zpe.thermalcorrenthalpy: 0.231288 hartree
zpe.thermalcorrgfe: 0.162699 hartree
zpe.sumelectzpe: -1287.324554 hartree
zpe.sumelectthermal: -1287.306063 hartree
zpe.sumelectthermalent: -1287.305119 hartree
zpe.sumelectthermalfe: -1287.373708 hartree
dipole: -0.0359 -4.3696 -3.0282
dipole: 5.3164
quadrupole: -90.2863 -127.7880 -121.1248
quadrupole: -21.1785 -0.2829 4.5735
quadrupole: 22.7801 -14.7216 -8.0584 -21.1785 -0.2829 4.5735
hfenergy: -1287.5364071 hartree
pointgroup: C01 [X(C11H11N3O4S1)]
dipole: 0.2822524 -1.8211294 0.9893478 debye
polarizability: 291.9208203|21.1449414|202.4412603|-2.4814691|-0.2767149|102.3238396 unknown
InChI: InChI=1S/C11H11N3O4S/c1-13-8-12-10(14(15)16)11(13)19(17,18)7-9-5-3-2-4-6-9/h2-6,8H,7H2,1H3
charge 0 multiplicity 1
30 atoms
S  0.154496 -1.126124 -0.369489
O  0.296999 -2.763055 -0.327796
O  0.510613 -0.341242 -1.749389
O  -0.596575 1.810203 0.474702
O  -2.680363 2.741364 0.33573
N  -2.683759 -1.789377 -0.128135
N  -3.803808 0.165663 0.229316
N  -1.892085 1.733237 0.341951
C  -1.712153 -0.791844 -0.019389
C  1.26693 -0.440579 1.270146
C  2.555752 0.057985 0.766122
C  -2.438078 0.399096 0.187537
C  -3.921483 -1.160028 0.036196
C  -2.517091 -3.234574 -0.403958
C  2.676737 1.402924 0.310789
C  3.688509 -0.804767 0.712576
C  3.916037 1.877252 -0.161996
C  4.924945 -0.324209 0.239614
C  5.040786 1.018229 -0.196436
H  0.580334 0.316429 1.667557
H  1.28601 -1.390978 1.822945
H  -4.860374 -1.707969 0.008669
H  -2.076179 -3.388129 -1.400408
H  -1.842999 -3.691905 0.33355
H  -3.514976 -3.699201 -0.357798
H  1.797837 2.055631 0.320982
H  3.591748 -1.84543 1.043974
H  4.006795 2.911084 -0.511292
H  5.794856 -0.988593 0.205548
H  6.00244 1.390908 -0.566618
