program: Gaussian 09
title: 000253291
version: EM64L-G09RevD.01
frameworkgroup: C1[X(C7H6Br3N)]
method: RPBEPBE
basis: SDD
operation: Freq
keyword: #p
keyword: freq=noraman
keyword: PBEPBE/SDD
title: #p freq=noraman PBEPBE/SDD
converged: NO NO NO NO
title: Mulliken charges:
elementType: Br Br Br N C C C C C C C H H H H H H
charge: 0.018197 0.062505 0.069339 0.037751 0.592652 -0.413480 0.181039 -0.182358 -0.783317 -0.770496 -0.358064 0.267034 0.244320 0.267027 0.262194 0.252845 0.252811
chargesum: 0.00000
title: Mulliken charges with hydrogens summed into heavy atoms:
elementType: Br Br Br N C C C C C C C
charge: 0.018197 0.062505 0.069339 0.037751 0.592652 -0.413480 0.181039 -0.182358 -0.004936 -0.002646 -0.358064
polarizability: 2.11964943e+02 4.93181644e+00 1.43162368e+02 -3.07710170e-03 -2.11551768e-03 5.57943731e+01
1716.lowfreq: -0.0006 -0.0003 -0.0003 2.0666 5.7848 7.2259 45.7579 73.9563 128.3548
frequency: 45.6851 73.9452 128.3546 138.2428 148.2037 153.4246 175.3780 201.2694 236.7238 275.8577 276.2679 302.9675 342.7829 411.1123 526.6216 534.1756 555.7163 595.2810 610.4719 733.6116 814.2805 922.4186 999.9457 1005.6339 1035.6247 1037.3624 1046.2841 1235.7618 1298.6862 1324.3388 1355.6499 1399.0100 1402.6371 1445.8631 1460.7858 1463.2162 1467.0025 1495.1798 1531.1048 2992.9365 2996.1848 3070.8710 3072.9526 3128.4272 3128.7236
redmass: 7.2620 4.2288 61.0881 1.1426 27.3491 2.1741 1.1895 61.6109 4.4699 7.0666 6.0282 3.3835 6.6220 5.3428 6.3091 4.1806 4.9995 6.2760 5.7074 5.9464 8.7657 4.6001 1.6715 6.5337 1.6827 1.5209 1.5311 6.8611 6.8419 8.6862 5.7752 1.2935 1.1864 1.4026 1.1515 1.0447 1.0431 3.3074 6.0286 1.0380 1.0387 1.0969 1.0970 1.0980 1.0991
irintensity: 0.0760 0.1990 0.2046 2.0937 0.0267 3.1780 0.2253 0.2304 3.3209 1.9701 0.0295 9.3969 0.0733 20.6023 1.4409 1.6562 0.1125 0.0100 23.1744 0.9785 52.4456 4.2295 108.5591 58.9071 6.3728 7.4052 3.0294 219.0844 20.2327 15.2883 65.4571 49.3296 13.6746 76.7058 23.7000 18.5778 14.0332 10.3768 16.4142 7.3310 4.3745 9.0152 7.2110 2.8423 9.8567
temp: 298.150 k
press: 1.00000 atm
elementType: 35 35 35 7 6 6 6 6 6 6 6 1 1 1 1 1 1
symmnumber: 1
zpe: 290674.5 jmol-1
zpe.correction: 0.110712 hartree
zpe.thermalcorrener: 0.122847 hartree
zpe.thermalcorrenthalpy: 0.123791 hartree
zpe.thermalcorrgfe: 0.069583 hartree
zpe.sumelectzpe: -364.666884 hartree
zpe.sumelectthermal: -364.654750 hartree
zpe.sumelectthermalent: -364.653805 hartree
zpe.sumelectthermalfe: -364.708013 hartree
dipole: -2.3307 1.4888 0.0003
dipole: 2.7657
quadrupole: -91.9034 -88.6713 -93.4085
quadrupole: 3.7322 -0.0010 0.0011
quadrupole: -0.5757 2.6565 -2.0808 3.7322 -0.0010 0.0011
hfenergy: -364.7775962 hartree
pointgroup: C01 [X(C7H6Br3N1)]
dipole: -0.8031817 0.7338479 -0.018006 debye
dipolederiv: -0.7613063 0.2511466 -0.0154753 0.298197 -0.1453044 0.0063119 -0.0158045 0.0054062 -0.0160424 -0.494325 -0.3517693 -0.0087278 -0.4047921 -0.2916897 -0.0068121 -0.0084657 -0.0057464 0.0159976 -0.7296563 0.3507296 -0.014902 0.3928731 -0.1939525 0.0081997 -0.0149487 0.0073409 -0.0240197 -0.9501304 0.1392115 -0.0158697 -0.3552721 -0.4879968 -0.0057671 -0.0142537 0.0037316 -0.1597126 -0.2564208 -0.1291352 -0.0059541 0.0359218 0.2525124 0.0001758 -0.0065121 -0.0029338 0.0696766 1.032503 -0.4505359 0.0242325 -0.6691116 -0.1056228 -0.0132486 0.0251008 -0.0090445 -0.1197535 0.2984078 0.3730719 0.002832 0.423185 0.4024232 0.0072163 0.0026181 0.0061959 0.0864354 0.4661117 0.8743766 0.0080384 0.8474018 0.178379 0.0154179 0.0080995 0.0158821 -0.1026851 0.0141397 -0.0817417 -0.0001768 -0.0056733 -0.2301605 0.0007457 -0.0004122 -0.0007292 0.0348224 -0.235752 -0.1875841 -0.0045654 -0.1181643 -0.0434798 -0.0021299 -0.0046594 -0.0031857 0.0308828 1.3637972 -0.9201262 0.0296874 -0.4574461 0.383823 -0.0101584 0.0280849 -0.0190773 -0.0040427 0.0723126 -0.0196853 0.0861788 -0.010525 0.0468569 0.0288991 0.0623177 0.0570087 -0.0039433 -0.0461851 0.1066612 -0.0034429 0.0309039 0.1000735 0.0006791 -0.0032265 0.0021271 0.1179007 0.0778746 -0.0180412 -0.0829588 -0.0098098 0.0463186 -0.0296375 -0.0591286 -0.0580729 -0.0089694 0.0990569 0.1156562 -0.0007203 0.0214417 -0.0518041 0.0008182 -0.0005292 0.002605 0.1220942 0.0214551 -0.0257546 0.0808421 -0.0084044 0.0696659 -0.0506406 0.0951946 -0.011163 -0.0158768 0.0281175 -0.02648 -0.0790181 -0.0107257 0.069958 0.0499305 -0.0934749 0.0096554 -0.0227642 unknown
polarizability: 211.5560835|-6.9352119|143.5101289|3.060303|-0.4275906|55.8554708 unknown
InChI: InChI=1S/C7H6Br3N/c1-3-5(8)4(2)11-7(10)6(3)9/h1-2H3
charge 0 multiplicity 1
17 atoms
Br -3.108254 0.998548 -0.05584
Br 2.720298 1.707922 0.055626
Br 2.965086 -1.75135 0.072004
N  0.153993 -1.634821 0.01701
C  -0.161488 1.185417 0.001659
C  -1.271805 0.29566 -0.017154
C  -1.10878 -1.117056 -0.009384
C  1.12934 0.573175 0.028755
C  -0.297935 2.690701 -0.005754
C  -2.252261 -2.101382 -0.028664
C  1.229561 -0.836962 0.035373
H  0.216996 3.119778 -0.884263
H  -1.351772 3.002253 -0.026824
H  0.183032 3.125479 0.889055
H  -1.841963 -3.121733 -0.018345
H  -2.91441 -1.964645 0.845751
H  -2.880737 -1.968886 -0.928204
