program: Gaussian 09
title: 000253647
version: EM64L-G09RevD.01
frameworkgroup: C1[X(C24H20N4O6)]
method: RPBEPBE
basis: SDD
operation: Freq
keyword: #p
keyword: freq=noraman
keyword: PBEPBE/SDD
title: #p freq=noraman PBEPBE/SDD
converged: YES YES NO NO
title: Mulliken charges:
elementType: O O O O O O N N N N C C C C C C C C C C C C C C C C C C C C C C C C H H H H H H H H H H H H H H H H H H H H
charge: -0.310973 -0.294891 -0.284298 -0.247264 -0.202338 -0.248038 -0.205953 -0.019792 -0.359690 -0.009058 -0.057317 -0.044897 -0.533130 -0.111256 -0.358166 0.339666 -0.235351 -0.121249 0.197577 0.030692 0.210996 0.207667 -0.243154 0.221749 -0.335384 -0.337654 -0.219185 -0.215885 -0.337370 -0.332237 -0.217491 -0.216421 -0.214404 -0.216875 0.297988 0.277310 0.255023 0.295083 0.306262 0.247643 0.258478 0.272407 0.364077 0.241565 0.270839 0.269217 0.238865 0.236814 0.270375 0.268715 0.238081 0.238286 0.236766 0.237577
chargesum: 0.00000
title: Mulliken charges with hydrogens summed into heavy atoms:
elementType: O O O O O O N N N N C C C C C C C C C C C C C C C C C C C C C C C C
charge: -0.310973 -0.294891 -0.284298 -0.247264 -0.202338 -0.248038 -0.205953 -0.019792 0.004387 -0.009058 0.240672 0.232413 0.016976 0.195007 0.147954 0.339666 0.037056 -0.121249 0.197577 0.030692 0.210996 0.207667 -0.001589 0.221749 -0.064545 -0.068436 0.019680 0.020929 -0.066995 -0.063521 0.020590 0.021865 0.022362 0.020702
polarizability: 3.71104302e+02 2.28394540e+01 2.56885811e+02 -4.18780903e+00 1.19210675e+00 2.87349740e+02
1716.lowfreq: -5.2540 -2.7565 -0.0005 -0.0002 0.0003 2.9895 5.6773 13.2435 18.3837
frequency: 3.5654 13.1615 18.2642 25.7490 26.2821 29.2608 39.6618 55.9272 60.7024 61.7782 75.6977 100.0648 123.0900 126.3285 138.7819 156.0094 168.5564 189.6655 198.2009 217.5425 227.6730 265.7703 283.2041 288.6818 315.0707 323.0392 335.7696 386.6387 402.2235 403.1830 403.4424 428.5704 433.3605 445.7874 450.1845 487.7969 494.4518 501.4883 532.4522 550.6848 590.5042 613.3378 613.7592 622.0925 648.2597 655.4862 662.3356 664.3018 680.1531 681.4210 686.4337 689.3800 701.2413 702.0475 727.8212 753.3018 756.2267 767.2030 787.8712 793.6897 796.2384 797.5541 851.2004 857.4455 865.2758 865.5105 865.7305 889.6711 894.7055 920.3230 932.9152 936.6080 957.0618 957.3522 974.1020 990.1684 990.3956 997.2278 997.3311 1009.5215 1011.4404 1011.6916 1014.8770 1018.3842 1036.0545 1040.3249 1043.0116 1056.9492 1083.8166 1087.3048 1088.1776 1091.3653 1099.9004 1153.4550 1176.3420 1176.4175 1179.8778 1184.6743 1185.6761 1193.3443 1226.4739 1237.5647 1242.7581 1249.8799 1262.7125 1280.0908 1290.6555 1298.4688 1316.9462 1317.7885 1318.3578 1323.4462 1340.2798 1347.7033 1358.0233 1363.3502 1366.5544 1391.1705 1391.3210 1419.0445 1439.0179 1439.2272 1449.1346 1462.1285 1478.0152 1478.2908 1508.5730 1530.8622 1584.2355 1584.9855 1596.8491 1610.8095 1611.1897 1623.4551 1628.2992 1633.7806 3019.0650 3036.3899 3038.8909 3076.3804 3088.8462 3114.7873 3118.7686 3124.9035 3134.7532 3135.0774 3146.6138 3146.9293 3158.1460 3158.1833 3169.4927 3170.0564 3180.1911 3182.0375 3238.1158 3503.6842
redmass: 8.6413 6.4197 5.9801 6.2007 5.0703 5.1527 5.9607 5.4176 6.8014 8.8456 7.9731 6.2118 8.4636 5.3065 6.7213 4.8280 4.6774 5.7184 5.8619 6.5223 6.5314 5.4033 7.1556 6.4095 7.6772 4.4448 4.4903 7.0285 3.2201 3.1231 3.0031 4.9739 4.5793 4.6788 3.7870 8.9917 3.7439 5.9693 3.3306 5.5147 7.1322 6.4451 6.4485 4.6146 5.4771 7.5301 6.1451 5.3741 5.0416 4.9471 3.4406 1.5176 1.6026 1.6120 5.3135 2.6742 2.4752 5.8396 4.4403 3.9322 2.1679 2.6504 4.3261 4.3028 1.5408 1.6141 2.1334 2.9317 1.4580 3.5033 6.5935 5.3332 1.4121 1.4108 2.6163 6.2827 6.2448 1.3879 1.3876 5.3594 1.3360 1.3444 4.0583 3.4783 2.6259 2.4994 2.9017 3.0851 1.9773 1.7203 1.6798 2.9000 2.1090 3.0643 1.0585 1.0602 1.5837 1.1876 1.1398 2.1513 1.3655 2.2315 3.5015 1.8319 2.2463 1.2718 1.4113 1.4078 1.3891 1.3170 1.3637 2.5520 1.8896 1.9596 1.3846 1.3093 1.5584 9.9316 9.8647 3.7007 2.2411 2.2499 1.0998 1.0944 2.2421 2.2716 4.8024 5.8246 6.6187 6.4743 7.4947 6.0359 6.0666 10.8422 10.3295 12.6068 1.0872 1.0606 1.0609 1.0866 1.0894 1.1058 1.1030 1.0925 1.0858 1.0858 1.0891 1.0891 1.0938 1.0939 1.0978 1.0982 1.0986 1.0978 1.0980 1.0800
irintensity: 2.7786 0.2881 0.8616 0.6080 1.4406 0.6943 0.4326 1.2807 2.8585 2.9734 2.5647 8.5605 1.5593 1.4352 2.7417 0.2551 1.3821 1.7576 2.8700 7.6683 2.9449 3.4171 1.5914 9.0998 10.0862 15.6253 4.0088 0.8940 9.8187 6.6466 4.2186 0.6917 2.8629 3.6062 1.1388 3.0328 2.6875 5.7662 1.6248 3.5554 5.9627 0.9308 0.7855 18.3583 9.3312 21.0179 7.0713 0.3455 8.9174 12.4178 52.4748 79.3833 120.8147 73.5038 26.1156 41.0033 5.7586 1.9815 0.1293 24.8265 23.3601 10.6053 9.9776 4.9098 1.2424 2.1925 3.9218 95.2036 9.4320 57.5208 17.5584 30.8436 4.3299 2.3549 23.0425 9.8981 4.3156 0.1453 0.2374 196.9248 1.6332 3.2675 210.6976 130.1952 204.2292 131.2321 24.0821 143.2674 32.3125 23.5908 18.2461 20.2392 21.8174 56.3705 0.5087 1.1962 48.2119 43.9150 58.8250 96.8933 93.0968 161.4346 290.4328 127.7956 4.4161 3.2016 20.8488 16.4449 12.2116 2.9873 16.5984 96.9429 25.7405 34.6848 21.0171 7.9037 1.1562 3.0203 3.2789 7.2252 19.5030 18.7873 23.1625 17.8763 6.3208 5.6584 42.2082 362.2983 28.2134 30.2152 51.4143 18.2898 17.7178 126.7993 211.5994 447.7664 22.8459 11.1197 22.1168 6.7787 5.5134 7.3501 6.9607 18.4024 0.2879 0.1794 7.3855 7.6838 13.2137 11.2065 19.6423 20.4860 8.9420 6.9777 0.2912 158.7416
temp: 298.150 k
press: 1.00000 atm
elementType: 8 8 8 8 8 8 7 7 7 7 6 6 6 6 6 6 6 6 6 6 6 6 6 6 6 6 6 6 6 6 6 6 6 6 1 1 1 1 1 1 1 1 1 1 1 1 1 1 1 1 1 1 1 1
symmnumber: 1
zpe: 1063520.9 jmol-1
zpe.correction: 0.405074 hartree
zpe.thermalcorrener: 0.433755 hartree
zpe.thermalcorrenthalpy: 0.434699 hartree
zpe.thermalcorrgfe: 0.338243 hartree
zpe.sumelectzpe: -1594.500142 hartree
zpe.sumelectthermal: -1594.471460 hartree
zpe.sumelectthermalent: -1594.470516 hartree
zpe.sumelectthermalfe: -1594.566972 hartree
dipole: 14.9462 3.0030 1.9821
dipole: 15.3732
quadrupole: -286.6490 -168.8212 -190.7718
quadrupole: -16.4002 -13.0865 9.4907
quadrupole: -71.2350 46.5928 24.6422 -16.4002 -13.0865 9.4907
hfenergy: -1594.9052153 hartree
pointgroup: C01 [X(C24H20N4O6)]
dipole: -5.8613529 1.1814524 -0.9112203 debye
polarizability: 368.5893403|-28.3540604|261.7863298|0.7124889|8.8347147|284.9641831 unknown
InChI: InChI=1S/C24H20N4O6/c29-22-20-21(25-13-26-22)28(14-27-20)19-11-17(34-24(31)16-9-5-2-6-10-16)18(33-19)12-32-23(30)15-7-3-1-4-8-15/h1-10,13-14,17-19,25H,11-12H2
charge 0 multiplicity 1
54 atoms
O  1.28433 -0.031737 -1.06157
O  -1.160635 1.694297 -0.598936
O  -1.089257 -2.122788 1.006835
O  -2.040304 2.831127 1.237796
O  7.569636 -0.98514 0.405433
O  -1.673552 -3.164028 -0.998195
N  3.180727 0.670492 0.22491
N  5.141824 0.708645 1.415674
N  3.922987 -0.873283 -1.604694
N  6.206988 -1.644476 -1.409286
C  -0.470483 0.783464 0.351639
C  1.857967 1.08984 -0.279003
C  0.850349 1.410981 0.848413
C  -0.025743 -0.432311 -0.468704
C  0.184388 -1.707869 0.373406
C  4.090779 -0.141001 -0.445468
C  3.889092 1.171328 1.351854
C  5.29325 -0.126869 0.288787
C  -1.953249 2.702826 -0.008206
C  6.453964 -0.911843 -0.167667
C  -2.63253 3.547489 -1.024913
C  -1.954481 -2.891799 0.194283
C  5.045732 -1.604747 -2.023898
C  -3.180575 -3.308835 0.922727
C  -3.453904 4.610143 -0.56296
C  -2.482046 3.319237 -2.418611
C  -4.119234 5.438256 -1.488731
C  -3.150767 4.151614 -3.339964
C  -4.154446 -4.056617 0.208651
C  -3.393857 -2.98553 2.289031
C  -3.968757 5.21051 -2.87804
C  -5.333234 -4.476082 0.856835
C  -4.575362 -3.408928 2.93207
C  -5.54567 -4.152797 2.21881
H  -1.157233 0.535265 1.17749
H  1.985035 1.92754 -0.989245
H  1.156859 0.924122 1.790426
H  0.737672 2.488737 1.036389
H  -0.709626 -0.633241 -1.308039
H  0.875766 -1.541787 1.215006
H  0.559543 -2.515968 -0.277256
H  3.435191 1.862143 2.058228
H  3.006228 -0.926798 -2.059379
H  4.89943 -2.178685 -2.947409
H  -3.556003 4.76645 0.516006
H  -1.849054 2.497162 -2.763654
H  -4.752588 6.257453 -1.132682
H  -3.037052 3.97676 -4.415002
H  -3.967538 -4.296835 -0.843164
H  -2.635735 -2.413966 2.831099
H  -4.486789 5.854719 -3.597089
H  -6.083863 -5.052821 0.306418
H  -4.740876 -3.161615 3.985927
H  -6.462199 -4.480001 2.722121
