program: Gaussian 09
title: 000253301
version: EM64L-G09RevD.01
frameworkgroup: C1[X(C16H14O3)]
method: RPBEPBE
basis: SDD
operation: Freq
keyword: #pfreq=noraman
keyword: PBEPBE/SDD
title: #p freq=noraman PBEPBE/SDD
converged: YES YES NO NO
title: Mulliken charges:
elementType: O O O C C C C C C C C C C C C C C C C H H H H H H H H H H H H H H
charge: -0.352109 -0.181350 -0.181578 0.256235 0.256303 0.455457 0.455209 -0.479120 -0.479040 -0.351553 -0.351395 -0.381428 -0.381651 -0.211211 -0.211106 0.168079 0.168501 -0.808962 -0.809736 0.269584 0.269481 0.272661 0.272660 0.236942 0.236903 0.234403 0.234419 0.229206 0.225535 0.241662 0.226690 0.231976 0.238332
chargesum: 0.00000
title: Mulliken charges with hydrogens summed into heavy atoms:
elementType: O O O C C C C C C C C C C C C C C C C
charge: -0.352109 -0.181350 -0.181578 0.256235 0.256303 0.455457 0.455209 -0.209536 -0.209558 -0.078892 -0.078735 -0.144486 -0.144748 0.023192 0.023313 0.168079 0.168501 -0.112560 -0.112737
polarizability: 2.60336602e+02 -1.93606267e-01 1.89935220e+02 1.38007151e+01 3.36781471e-01 1.13602790e+02
1716.lowfreq: -0.0009 -0.0008 -0.0005 5.5602 6.4871 10.4234 16.4510 21.4388 29.2677
frequency: 16.2337 21.3938 29.2636 37.5833 45.4958 67.1083 83.7400 140.4354 152.6605 186.1358 201.6973 213.9769 214.5125 249.2256 333.1026 339.7854 355.7783 421.1783 422.8687 443.4218 484.3928 486.4834 500.9399 519.7490 525.1267 609.2436 660.4292 677.5378 679.1072 708.6855 709.6447 727.0732 771.4182 817.3553 823.2160 852.0352 880.4913 913.8467 916.4724 950.0166 952.6174 963.9109 983.1180 989.9978 991.4709 1000.1369 1000.8805 1001.5615 1009.8737 1052.1709 1052.7498 1101.5957 1102.1819 1159.9120 1181.4265 1181.6159 1194.2303 1252.3362 1279.5491 1303.2758 1304.3173 1387.8436 1387.9614 1399.1404 1401.4595 1423.8513 1424.5188 1470.8282 1471.4835 1474.6083 1475.0114 1480.9227 1482.0592 1593.3521 1593.9352 1613.2401 1614.4105 1629.4813 1685.7808 2978.4268 2979.2711 3060.8373 3061.1141 3089.2042 3089.6421 3124.8283 3125.4082 3148.0383 3148.1193 3159.0046 3159.1367 3168.4912 3168.6228
redmass: 1.0562 3.8143 4.7243 4.3830 1.0145 8.2136 7.2427 4.7723 5.1128 5.5396 10.0468 3.1038 3.1242 4.4842 3.8693 3.9883 5.9724 3.2141 3.0678 4.7755 4.1522 3.8301 5.1274 5.2199 6.0525 8.4895 6.5136 4.0060 4.8997 2.4777 3.2332 3.5277 4.0990 1.6109 1.8509 5.4780 4.7338 1.3243 1.3208 1.4622 1.4379 4.5088 2.0593 5.9251 4.6848 1.4915 1.3626 1.4909 2.0543 1.5782 1.5772 1.5179 1.5388 1.7718 1.1265 1.1300 1.7766 4.0104 5.1665 1.2983 1.3000 7.4825 7.5572 1.2243 1.2238 2.7367 2.7606 1.6383 1.5935 1.0603 1.0598 1.4851 1.5773 5.9666 5.9137 6.5462 6.3201 11.6195 12.6739 1.0388 1.0387 1.0950 1.0952 1.0999 1.0999 1.0885 1.0883 1.0914 1.0914 1.0918 1.0919 1.0985 1.0985
irintensity: 0.8310 0.4235 0.9044 0.4785 0.7843 0.5939 0.1054 1.0065 0.1302 0.1178 0.0442 3.4291 1.6029 0.4412 11.6473 0.4344 0.6536 1.5141 1.8693 0.2906 7.1679 2.4552 4.1551 0.6107 9.0818 18.7851 1.4833 27.0038 1.8466 11.7815 52.4306 65.2869 26.4340 51.2459 5.8397 0.7970 279.0522 1.9515 1.2536 60.8427 2.9259 1123.8338 1.7319 0.1246 64.6553 16.5447 1.0357 18.9165 3.6720 18.1930 13.2757 0.2479 0.7674 425.7737 0.4501 0.2361 3.8101 189.3368 11.4235 0.3497 0.4488 3.3949 3.8772 14.0259 14.4907 0.3675 1.1864 30.3113 13.8484 14.2577 12.5026 7.9848 7.0844 32.4553 42.5937 22.7185 7.8727 93.8339 332.0716 25.4104 27.5384 19.9591 19.0267 19.2019 14.3137 10.3702 10.1558 19.3476 7.0966 5.6648 3.3240 27.3993 1.1331
temp: 298.150 k
press: 1.00000 atm
elementType: 8 8 8 6 6 6 6 6 6 6 6 6 6 6 6 6 6 6 6 1 1 1 1 1 1 1 1 1 1 1 1 1 1
symmnumber: 1
zpe: 668221.0 jmol-1
zpe.correction: 0.254512 hartree
zpe.thermalcorrener: 0.272391 hartree
zpe.thermalcorrenthalpy: 0.273335 hartree
zpe.thermalcorrgfe: 0.204545 hartree
zpe.sumelectzpe: -842.460361 hartree
zpe.sumelectthermal: -842.442483 hartree
zpe.sumelectthermalent: -842.441538 hartree
zpe.sumelectthermalfe: -842.510329 hartree
dipole: -0.0207 5.8176 0.0892
dipole: 5.8183
quadrupole: -78.2728 -115.4995 -112.1827
quadrupole: 0.1252 -0.1901 0.2009
quadrupole: 23.7122 -13.5145 -10.1977 0.1252 -0.1901 0.2009
hfenergy: -842.7148731 hartree
pointgroup: C01 [X(C16H14O3)]
dipole: -0.012287 2.2890579 0.0035519 debye
polarizability: 260.4349464|0.1224525|189.9301971|13.2687737|-0.6920649|113.5094682 unknown
InChI: InChI=1S/C16H14O3/c1-11-5-3-7-13(9-11)15(17)19-16(18)14-8-4-6-12(2)10-14/h3-10H,1-2H3
charge 0 multiplicity 1
33 atoms
O  -0.001034 -0.560549 0.011001
O  -1.084865 -2.398768 -0.978186
O  1.085563 -2.357695 1.070006
C  -2.400402 -0.468064 -0.273128
C  2.397064 -0.449926 0.298191
C  -3.591758 1.521944 0.559828
C  3.585796 1.510987 -0.604565
C  -2.396718 0.780389 0.400095
C  2.392444 0.77191 -0.422181
C  -3.610685 -0.988788 -0.803322
C  3.607967 -0.949707 0.846832
C  -4.791754 0.98956 0.019012
C  4.787835 0.995834 -0.051733
C  -4.802654 -0.254935 -0.654338
C  4.79978 -0.22237 0.66808
C  -1.165323 -1.2768 -0.449102
C  1.164201 -1.25617 0.499285
C  -3.594117 2.841624 1.311138
C  3.576166 2.831307 -1.354954
H  -1.452835 1.163493 0.800402
H  1.449639 1.135314 -0.842926
H  -3.591763 -1.954629 -1.318426
H  3.590633 -1.897751 1.394046
H  -5.725457 1.554969 0.127525
H  5.722762 1.55276 -0.189661
H  -5.740655 -0.646257 -1.062323
H  5.739877 -0.60219 1.082059
H  -2.639624 3.381925 1.185119
H  -4.409697 3.502008 0.968454
H  -3.736808 2.678053 2.396866
H  4.55605 3.04151 -1.817749
H  2.812773 2.837941 -2.152395
H  3.346298 3.673076 -0.673249
