program: Gaussian 09
title: 000253345
version: EM64L-G09RevD.01
frameworkgroup: C1[X(C16H24N2O2S2)]
method: RPBEPBE
basis: SDD
operation: Freq
keyword: #p
keyword: freq=noraman
keyword: PBEPBE/SDD
title: #p freq=noraman PBEPBE/SDD
converged: YES YES NO NO
title: Mulliken charges:
elementType: S S O O N N C C C C C C C C C C C C C C C C H H H H H H H H H H H H H H H H H H H H H H H H
charge: 0.114510 0.266390 -0.279571 -0.277204 0.005532 -0.024259 -0.386644 -0.397783 -0.558432 -0.260662 -0.243742 -0.516377 -0.207037 -0.206830 -0.354942 0.374643 -0.677464 -0.675957 -0.274566 -0.348329 -0.243957 -0.213406 0.239923 0.222924 0.236257 0.225904 0.263436 0.304730 0.248712 0.194627 0.193219 0.218687 0.200273 0.184062 0.188821 0.192476 0.225042 0.228199 0.203917 0.228905 0.227961 0.204697 0.244070 0.251446 0.228829 0.228970
chargesum: 0.00000
title: Mulliken charges with hydrogens summed into heavy atoms:
elementType: S S O O N N C C C C C C C C C C C C C C C C
charge: 0.114510 0.266390 -0.279571 -0.277204 0.005532 -0.024259 0.076202 0.064379 0.009733 0.182678 0.168165 -0.516377 0.177297 0.174466 -0.354942 0.374643 -0.020305 -0.014393 -0.030497 -0.096883 -0.015129 0.015565
polarizability: 3.56918961e+02 1.93165079e+01 2.02004441e+02 -2.11248859e+01 3.23872674e+01 1.84652293e+02
1716.lowfreq: -25.0810 -8.5134 -6.1890 -0.0003 0.0012 0.0016 7.2739 14.9448 17.2345
frequency: -22.1414 14.0019 16.8033 21.5050 25.9177 42.6750 43.0023 56.2660 80.6022 87.5396 97.6610 104.9458 119.5596 123.4894 132.8131 149.5171 179.1131 186.4617 232.0880 234.4421 235.9159 276.7921 289.2532 315.3062 341.0040 346.0608 361.8624 379.8169 415.6595 429.6704 442.3228 467.0933 485.3745 505.5702 513.6586 534.6240 571.9344 580.8082 605.2684 677.7787 729.0523 762.5748 790.7592 803.3641 812.7655 816.8679 821.2864 836.6314 838.9106 859.6659 899.9879 900.9417 907.6654 940.3864 979.5593 997.8589 1002.4909 1016.7850 1032.0311 1040.3689 1048.4954 1066.0047 1071.4537 1074.0343 1097.4497 1117.6224 1120.1144 1122.1630 1129.0582 1138.4062 1142.5410 1155.9764 1167.8814 1182.2539 1199.2035 1225.3686 1250.6571 1252.3945 1267.9196 1271.9602 1275.0070 1304.4908 1317.3238 1345.3617 1354.7427 1358.3441 1374.0493 1388.4515 1389.9797 1403.6440 1405.6935 1409.1890 1431.4961 1441.4897 1446.0919 1453.6642 1457.0578 1459.3384 1459.8569 1473.9515 1476.8152 1480.6984 1482.7507 1486.5557 1494.2087 1496.8163 1567.2901 1599.3958 2920.1245 2923.6520 2930.2965 2942.6983 2971.6686 2973.7051 2981.8674 2993.8109 2994.7991 3005.0150 3009.8318 3013.0225 3059.3712 3071.5804 3079.5379 3092.2427 3092.8658 3100.1016 3101.5975 3133.6418 3147.4131 3161.6289 3168.8675 3172.4084
redmass: 2.1115 5.7326 5.9780 4.5204 3.8607 2.2848 2.2714 3.5440 3.8771 3.5468 3.0844 5.8118 3.3947 2.7306 3.2152 3.4480 4.4174 5.8258 2.4824 1.1601 1.6164 3.5267 6.5142 5.0082 4.1762 3.2371 11.4437 9.1715 2.8550 3.1366 3.0198 2.9201 9.0394 2.5777 6.4263 4.6755 10.0058 5.0108 8.7111 7.0505 2.6598 1.5403 1.1930 1.3507 1.3625 1.1951 1.4197 3.3995 4.3392 1.3810 4.0692 5.7911 1.5476 1.3842 1.3136 3.5470 3.5356 2.2028 3.2153 5.3592 3.4353 3.0976 3.6060 3.2035 1.7926 1.5430 1.9341 2.0632 1.7456 1.4291 1.4482 1.3080 1.1180 1.1309 1.1669 2.8168 1.1423 1.1441 1.2069 1.5729 1.2102 1.2321 1.2017 1.6588 1.2721 1.3258 4.6170 1.2428 1.2400 1.4867 1.5828 1.6217 2.8518 2.7082 1.5008 3.0159 1.0919 1.0413 1.0408 1.1091 1.0850 1.1456 1.1064 1.0776 1.0831 1.0802 6.2535 7.0859 1.0556 1.0559 1.0556 1.0590 1.1066 1.1062 1.1055 1.0356 1.0358 1.0591 1.0604 1.1001 1.0575 1.1055 1.1058 1.0991 1.0991 1.1010 1.1010 1.0854 1.0901 1.0952 1.1168 1.1001
irintensity: 0.6733 0.2022 0.1788 0.0221 0.4367 1.4205 0.8149 3.5006 3.5977 1.1543 4.3126 1.1765 5.0237 0.1629 2.8891 9.1450 35.6491 2.3681 5.7253 0.3305 10.1039 0.2195 0.0475 28.0821 38.8862 1.2030 41.0881 3.5740 44.2808 7.7328 28.7209 11.4993 0.6672 7.6543 1.0726 91.9831 14.7083 0.8940 30.5309 4.1965 18.3729 79.8051 0.9462 5.5350 1.0050 3.6012 16.9959 3.6358 9.5207 1.1645 121.3904 155.2212 39.6660 2.9815 0.0728 38.3900 15.4888 6.5058 2.7416 11.8649 32.1733 68.9233 200.1385 101.8823 70.8399 7.8974 17.8963 16.4618 11.4260 72.7929 1.5692 42.5309 1.4121 0.9801 0.6373 9.1571 0.1920 0.2868 7.7229 8.0987 17.4124 9.0363 5.9769 3.4354 21.3836 6.7610 6.1265 18.6228 4.4289 45.8799 128.4651 95.3081 66.9459 11.0469 108.6921 124.6004 10.9340 10.5623 11.5355 12.2773 12.4369 60.5676 9.4047 0.6964 4.2078 6.9127 1.2722 1.2741 32.7547 58.8661 85.7746 49.9954 56.5737 56.5022 27.5475 24.6995 26.4579 39.4980 48.9823 17.6279 18.1028 16.4472 37.1472 29.3151 34.5533 36.1727 37.4482 1.6482 9.2628 19.3520 3.4342 22.9859
temp: 298.150 k
press: 1.00000 atm
elementType: 16 16 8 8 7 7 6 6 6 6 6 6 6 6 6 6 6 6 6 6 6 6 1 1 1 1 1 1 1 1 1 1 1 1 1 1 1 1 1 1 1 1 1 1 1 1
symmnumber: 1
zpe: 985068.5 jmol-1
zpe.correction: 0.375193 hartree
zpe.thermalcorrener: 0.399642 hartree
zpe.thermalcorrenthalpy: 0.400586 hartree
zpe.thermalcorrgfe: 0.315819 hartree
zpe.sumelectzpe: -1678.434844 hartree
zpe.sumelectthermal: -1678.410395 hartree
zpe.sumelectthermalent: -1678.409451 hartree
zpe.sumelectthermalfe: -1678.494218 hartree
dipole: -0.9840 1.6135 -0.8173
dipole: 2.0590
quadrupole: -131.2831 -153.2442 -141.1589
quadrupole: 4.6261 2.7969 -1.6529
quadrupole: 10.6123 -11.3488 0.7365 4.6261 2.7969 -1.6529
hfenergy: -1678.8100371 hartree
pointgroup: C01 [X(C16H24N2O2S2)]
dipole: 0.6281515 -0.2126598 -0.4652009 debye
polarizability: 272.0482057|74.388457|294.3253852|9.955448|-36.9208873|177.2021044 unknown
InChI: InChI=1S/C16H24N2O2S2/c1-3-19-11-9-18(10-12-20-4-2)13-21-16-17-14-7-5-6-8-15(14)22-16/h5-8H,3-4,9-13H2,1-2H3
charge 0 multiplicity 1
46 atoms
S  -1.312435 1.567652 -0.058548
S  -3.752854 -0.315301 -0.645249
O  2.226647 -2.083101 -0.605642
O  2.906039 3.885895 -1.261014
N  1.519407 1.236473 1.000098
N  -1.752009 -0.940523 1.061309
C  2.025831 -0.132001 0.754068
C  2.300568 2.384682 0.498938
C  0.224778 1.423343 1.451731
C  1.485705 -0.820831 -0.517665
C  2.185866 2.634987 -1.021245
C  -2.144698 0.024665 0.249523
C  1.676717 -2.990398 -1.625846
C  2.922728 4.26822 -2.682747
C  -3.786287 -1.910077 0.222934
C  -2.639776 -2.035315 1.076693
C  2.524314 -4.262132 -1.615621
C  3.680734 5.590087 -2.795682
C  -4.75179 -2.930212 0.131607
C  -2.470277 -3.209498 1.84797
C  -4.566751 -4.096479 0.910645
C  -3.436291 -4.232601 1.759416
H  1.77123 -0.771403 1.618606
H  3.127713 -0.086576 0.686245
H  3.36543 2.238951 0.757036
H  1.957627 3.299825 1.01545
H  0.038428 2.403558 1.908181
H  -0.199602 0.56606 1.992507
H  0.397993 -1.010998 -0.423689
H  1.662398 -0.20453 -1.425757
H  2.648194 1.80607 -1.601617
H  1.120377 2.72287 -1.326326
H  0.613472 -3.214222 -1.38805
H  1.708298 -2.49743 -2.623274
H  3.419572 3.468971 -3.27697
H  1.878743 4.371845 -3.053241
H  3.576865 -4.027968 -1.851398
H  2.490248 -4.738467 -0.620638
H  2.147282 -4.983166 -2.363644
H  3.177925 6.374989 -2.204996
H  4.711035 5.477919 -2.416308
H  3.72779 5.919009 -3.849765
H  -5.624901 -2.831312 -0.520662
H  -1.594377 -3.301611 2.497321
H  -5.307163 -4.901769 0.856251
H  -3.31404 -5.144654 2.35356
