program: Gaussian 09
title: 000253289
version: EM64L-G09RevD.01
frameworkgroup: C1[X(C13H11N3)]
method: RPBEPBE
basis: SDD
operation: Freq
keyword: #pfreq=noraman
keyword: PBEPBE/SDD
title: #p freq=noraman PBEPBE/SDD
converged: NO YES NO NO
title: Mulliken charges:
elementType: N N N C C C C C C C C C C C C C H H H H H H H H H H H
charge: -0.218835 -0.092007 -0.121403 0.267619 -0.028945 0.400378 -0.377797 0.314355 -0.326501 -0.275735 -0.803903 -0.358906 -0.384733 -0.232406 -0.229841 -0.236631 0.284933 0.258269 0.243709 0.227664 0.237342 0.237338 0.262541 0.273260 0.225980 0.226666 0.227589
chargesum: 0.00000
title: Mulliken charges with hydrogens summed into heavy atoms:
elementType: N N N C C C C C C C C C C C C C
charge: -0.218835 -0.092007 -0.121403 0.267619 -0.028945 0.400378 -0.092864 0.314355 -0.068232 -0.032025 -0.101559 -0.096365 -0.111473 -0.006426 -0.003176 -0.009042
polarizability: 3.05816299e+02 -3.77273341e+00 1.53750214e+02 -2.56151671e-03 -7.16575499e-03 6.65529378e+01
1716.lowfreq: -4.0641 -0.0006 -0.0004 0.0008 5.6565 10.2303 48.3122 60.1768 95.1881
frequency: 48.2766 60.1703 95.1821 119.9107 147.1202 204.9539 256.3599 283.6286 292.4721 347.9446 368.0388 404.8683 432.6001 493.1733 502.7189 540.4116 588.3131 612.2059 620.3354 686.6305 701.2697 706.0666 747.7592 750.6581 790.9213 816.6996 831.4479 862.4579 863.2521 915.8707 942.3621 945.9681 964.7578 989.0805 992.4734 1004.2293 1012.5440 1021.9925 1051.2638 1075.3845 1079.1638 1120.0865 1135.6402 1171.9090 1183.4816 1236.0564 1240.1764 1255.5626 1306.8423 1323.2003 1357.4378 1385.9514 1393.0435 1406.2018 1434.4625 1443.5610 1467.9474 1473.2384 1508.9602 1515.6949 1551.6191 1587.6086 1620.3208 1643.2486 2979.7627 3059.0357 3090.2063 3123.6219 3135.0983 3143.9559 3150.2813 3160.6821 3168.7276 3188.7257 3194.3953
redmass: 3.9770 4.8812 4.6348 1.1385 3.2736 4.8950 3.7125 5.6866 4.8230 4.6385 3.7106 2.8478 3.0266 6.1725 3.7426 7.3229 3.3173 6.2102 6.0775 6.6284 2.8823 2.3671 4.5730 6.5540 2.1876 1.4729 4.7269 1.3342 1.2695 6.4071 4.2074 1.4376 1.3041 6.2226 1.3782 1.3241 1.5945 2.3156 1.4970 1.9813 2.4156 3.9620 1.5262 1.0558 1.1175 3.0868 2.8969 3.7512 1.6282 1.4586 3.3224 9.2868 3.6204 1.2323 3.1234 2.3983 1.0446 1.2225 3.5646 4.3299 5.4752 6.3243 6.1487 7.0552 1.0371 1.0982 1.0989 1.0849 1.0890 1.0904 1.0936 1.0958 1.1002 1.0957 1.0948
irintensity: 0.6663 2.1092 1.8285 0.0678 0.0778 0.0148 0.3205 0.1823 0.0068 6.1253 2.0198 0.0000 4.3296 0.1244 6.7837 0.4314 13.2748 0.4719 0.6895 7.3383 14.7966 63.1277 3.5525 1.0607 36.3130 52.5267 1.2910 5.3273 1.2241 0.1334 0.2547 6.2113 0.6404 0.0049 0.0002 0.8301 6.2563 24.1060 11.5296 15.2346 2.9327 16.9316 9.9011 0.0249 11.2022 15.3419 37.2402 4.3853 24.1956 4.8124 12.2416 0.4919 12.2527 5.6099 193.5835 16.4777 14.1561 5.7666 49.2385 13.7396 6.3558 0.2041 1.7379 5.6742 39.8370 17.9350 16.1267 0.4177 14.9034 9.8038 27.8940 14.5697 20.8304 2.3642 2.7521
temp: 298.150 k
press: 1.00000 atm
elementType: 7 7 7 6 6 6 6 6 6 6 6 6 6 6 6 6 1 1 1 1 1 1 1 1 1 1 1
symmnumber: 1
zpe: 552242.2 jmol-1
zpe.correction: 0.210338 hartree
zpe.thermalcorrener: 0.222770 hartree
zpe.thermalcorrenthalpy: 0.223714 hartree
zpe.thermalcorrgfe: 0.170958 hartree
zpe.sumelectzpe: -665.135289 hartree
zpe.sumelectthermal: -665.122857 hartree
zpe.sumelectthermalent: -665.121913 hartree
zpe.sumelectthermalfe: -665.174669 hartree
dipole: -3.5391 -0.6879 0.0001
dipole: 3.6053
quadrupole: -64.9134 -86.9938 -98.4110
quadrupole: 0.0512 -0.0004 -0.0012
quadrupole: 18.5260 -3.5544 -14.9716 0.0512 -0.0004 -0.0012
hfenergy: -665.3456271 hartree
pointgroup: C01 [X(C13H11N3)]
dipole: -1.3907161 -0.2791265 0.0000412 debye
polarizability: 305.8566325|-2.8457803|153.7098799|-0.0025178|-0.0071812|66.5529378 unknown
InChI: InChI=1S/C13H11N3/c1-10-7-8-12-14-13(15-16(12)9-10)11-5-3-2-4-6-11/h2-9H,1H3
charge 0 multiplicity 1
27 atoms
N  -1.495105 -0.454355 0.000137
N  -0.227479 -1.027251 0.000115
N  -0.077589 1.310419 0.000004
C  -1.396575 0.966237 0.000014
C  0.589173 0.091357 0.000064
C  -3.883843 -0.413573 0.000171
C  -2.6921 -1.137589 0.000215
C  2.05432 -0.02178 0.00006
C  -2.603956 1.714238 -0.000026
C  -3.821331 1.027279 0.000052
C  -5.221663 -1.126933 0.000232
C  2.685765 -1.295136 0.000173
C  2.849452 1.155121 -0.00006
C  4.092513 -1.385862 0.000165
C  4.256343 1.058143 -0.000069
C  4.883379 -0.211052 0.000043
H  -2.628979 -2.226914 0.000295
H  -2.54669 2.804913 -0.000104
H  -4.759801 1.592821 0.000028
H  -5.097173 -2.223237 0.000438
H  -5.817643 -0.853494 -0.890536
H  -5.817735 -0.853168 0.890837
H  2.064142 -2.196471 0.000265
H  2.344662 2.126405 -0.000142
H  4.574244 -2.370279 0.000255
H  4.864591 1.969801 -0.000163
H  5.976978 -0.284441 0.000036
