program: Gaussian 09
title: 000253305
version: EM64L-G09RevD.01
frameworkgroup: C1[X(C7H14N2O4S2)]
method: RPBEPBE
basis: SDD
operation: Freq
keyword: #p
keyword: freq=noraman
keyword: PBEPBE/SDD
title: #p freq=noraman PBEPBE/SDD
converged: YES YES NO NO
title: Mulliken charges:
elementType: S S O O O O N N C C C C C C C H H H H H H H H H H H H H H
charge: 0.159511 0.208711 -0.412621 -0.428853 -0.257281 -0.245387 -0.560583 -0.638635 -0.147095 -0.083065 -0.677648 -0.716102 -0.880964 0.209058 0.236918 0.265594 0.272602 0.285105 0.261968 0.267706 0.290738 0.325170 0.347605 0.292057 0.280769 0.307768 0.279356 0.375840 0.381757
chargesum: 0.00000
title: Mulliken charges with hydrogens summed into heavy atoms:
elementType: S S O O O O N N C C C C C C C
charge: 0.159511 0.208711 -0.036781 -0.047095 -0.257281 -0.245387 0.012242 -0.051511 0.118499 0.189536 -0.130575 -0.157658 -0.208189 0.209058 0.236918
polarizability: 1.77793465e+02 -1.40042136e+01 1.41908365e+02 -3.10594952e+00 -3.71514456e-01 1.04142899e+02
1716.lowfreq: -0.0023 -0.0012 0.0025 1.3872 7.0062 8.3034 19.0006 27.0295 43.5292
frequency: 18.5524 27.0077 43.5222 46.0875 50.1808 77.0236 93.3899 107.5148 136.2300 177.6948 194.1619 215.2112 235.4497 243.9316 260.5782 269.6318 298.3849 307.8131 317.4876 376.2820 377.5219 459.6943 471.8574 530.8156 567.2744 578.8870 591.2320 620.6553 631.3654 644.6882 667.3278 676.6499 685.6253 718.5384 731.1530 762.8044 780.8804 848.2956 910.5647 919.4277 992.4730 998.8110 1049.5559 1052.7544 1090.8113 1099.7183 1117.1580 1146.0923 1176.0131 1201.2625 1206.9058 1231.4410 1242.2002 1258.1989 1268.2265 1277.8717 1309.3752 1349.7427 1360.2234 1377.8770 1416.0834 1425.8464 1428.3177 1634.4034 1636.2024 1645.0052 1669.1121 2886.3820 3033.7810 3040.3175 3046.7567 3068.2505 3117.3765 3120.1114 3142.5205 3461.5750 3466.9712 3502.7511 3521.1496 3593.1283 3601.8065
redmass: 6.7696 7.1371 4.8159 7.3727 6.6717 7.6672 7.6056 5.2619 11.4969 4.8947 3.4463 3.8452 4.7129 3.7053 2.7607 1.3394 3.0324 1.2254 2.1695 5.1782 4.3681 3.9748 3.6952 3.6583 2.8284 1.3131 1.4493 1.5216 6.3356 1.5539 3.0523 3.9363 5.5582 4.5536 4.2765 3.3704 2.2188 1.6618 1.9066 1.7223 3.2473 3.9026 2.1982 2.2598 1.9560 2.8904 1.1765 1.1143 1.1137 1.4461 1.3550 1.1436 1.4796 1.1938 1.7019 1.2943 1.2971 1.7167 1.3357 1.9585 1.0748 1.0867 1.0903 1.1553 1.0918 5.7438 9.0346 1.0799 1.0603 1.0583 1.0540 1.0858 1.1062 1.1050 1.1126 1.0449 1.0445 1.0639 1.0641 1.0983 1.0993
irintensity: 0.2712 1.0213 1.8676 1.1127 1.9664 2.5269 0.7784 6.9121 0.5532 0.8831 2.9845 1.3224 2.5861 3.7180 5.1309 26.9886 9.9535 65.4280 12.6620 13.7720 8.0515 45.5698 29.4445 6.1825 23.2491 263.1153 12.6886 120.7093 17.0008 297.2805 146.8242 16.1518 23.1469 33.5186 5.6258 2.1155 2.6513 8.3715 4.4741 13.5600 70.6102 30.8900 371.9460 161.6631 11.4311 17.9938 4.4576 11.0007 1.0732 5.9271 2.4509 22.4934 3.4894 3.4771 11.7965 5.4890 5.3110 14.0119 7.7881 20.2336 11.0723 31.8040 12.2718 56.9133 55.2760 185.6702 181.3435 42.0088 9.7774 15.5755 3.7102 7.8483 3.7061 5.4560 2.5464 4.5291 4.3760 23.1239 26.1127 6.2460 6.0091
temp: 298.150 k
press: 1.00000 atm
elementType: 16 16 8 8 8 8 7 7 6 6 6 6 6 6 6 1 1 1 1 1 1 1 1 1 1 1 1 1 1
symmnumber: 1
zpe: 579805.8 jmol-1
zpe.correction: 0.220836 hartree
zpe.thermalcorrener: 0.239411 hartree
zpe.thermalcorrenthalpy: 0.240355 hartree
zpe.thermalcorrgfe: 0.171359 hartree
zpe.sumelectzpe: -1480.453135 hartree
zpe.sumelectthermal: -1480.434560 hartree
zpe.sumelectthermalent: -1480.433616 hartree
zpe.sumelectthermalfe: -1480.502612 hartree
dipole: -1.1666 1.9135 -0.9726
dipole: 2.4430
quadrupole: -81.9483 -99.5125 -108.4061
quadrupole: 1.8137 -7.3376 2.8534
quadrupole: 14.6740 -2.8902 -11.7838 1.8137 -7.3376 2.8534
hfenergy: -1480.6739713 hartree
pointgroup: C01 [X(C7H14N2O4S2)]
dipole: 0.3991574 0.4598541 -0.7436553 debye
polarizability: 174.9035303|-2.7182271|104.7489388|-17.3341314|-4.203265|144.1922594 unknown
InChI: InChI=1S/C7H14N2O4S2/c8-4(6(10)11)1-14-3-15-2-5(9)7(12)13/h4-5,10,12H,1-3,8-9H2
charge 0 multiplicity 1
29 atoms
S  0.521121 0.497369 0.100803
S  -1.041418 -0.598408 2.545555
O  4.574051 0.516909 0.9009
O  -3.304053 0.369924 -1.76435
O  3.307386 -1.43045 0.966904
O  -2.250109 -1.543091 -0.993859
N  3.963387 -0.471922 -2.059678
N  -4.540672 0.499727 0.689549
C  3.119305 0.10644 -0.99585
C  -3.101756 0.158008 0.62797
C  1.648897 -0.285068 -1.213932
C  -2.75065 -0.831281 1.765017
C  0.095658 -1.049438 1.136841
C  3.608417 -0.358761 0.388372
C  -2.818492 -0.4596 -0.745372
H  3.219346 1.203536 -1.037236
H  -2.425317 1.043967 0.704094
H  1.317207 0.068989 -2.201578
H  1.514926 -1.379404 -1.156243
H  -3.437942 -0.667925 2.611795
H  -2.850357 -1.87489 1.428386
H  -0.399769 -1.783891 0.484557
H  1.026652 -1.445838 1.566338
H  4.885966 -0.0414 -2.163755
H  3.989367 -1.496274 -2.073957
H  -4.892513 0.943678 -0.164665
H  -4.796705 1.014434 1.537607
H  4.928181 0.157994 1.760134
H  -3.104015 -0.040331 -2.64865
