program: Gaussian 09
title: 000253387
version: EM64L-G09RevD.01
frameworkgroup: C1[X(C22H26O4)]
method: RPBEPBE
basis: SDD
operation: Freq
keyword: #pfreq=noraman
keyword: PBEPBE/SDD
title: #p freq=noraman PBEPBE/SDD
converged: YES YES NO NO
title: Mulliken charges:
elementType: O O O O C C C C C C C C C C C C C C C C C C C C C C H H H H H H H H H H H H H H H H H H H H H H H H H H
charge: -0.303217 -0.172397 -0.258154 -0.262865 0.088907 -0.356085 0.382898 -0.464723 -0.507694 0.248695 0.094414 -0.591170 0.105798 -0.761462 -0.545206 -0.776069 0.172214 -0.637511 0.409523 -0.364712 -0.605140 0.320418 -0.408448 0.327131 -0.772611 -0.536237 0.321505 0.244474 0.206286 0.228258 0.229595 0.240130 0.236675 0.201541 0.231804 0.239861 0.231066 0.219051 0.270124 0.218792 0.228492 0.218134 0.229175 0.248669 0.248512 0.250363 0.259365 0.241802 0.242755 0.219926 0.221223 0.246127
chargesum: 0.00000
title: Mulliken charges with hydrogens summed into heavy atoms:
elementType: O O O O C C C C C C C C C C C C C C C C C C C C C C
charge: -0.303217 -0.172397 -0.258154 -0.262865 0.088907 -0.034580 0.382898 -0.013963 -0.049841 0.248695 0.094414 -0.114364 0.105798 -0.088256 -0.095088 -0.058661 0.172214 -0.190203 0.409523 -0.116043 -0.356629 0.320418 -0.158085 0.327131 -0.028689 0.151038
polarizability: 3.49958473e+02 -2.43249813e+01 2.33837110e+02 1.31899536e+01 1.64855310e+01 1.75568934e+02
1716.lowfreq: -0.0009 -0.0008 0.0003 3.5652 4.2767 15.3334 29.5710 45.6551 58.2977
frequency: 28.8270 45.1106 58.2364 62.1319 76.3666 85.4973 96.0752 104.7935 128.2938 135.7466 151.1241 174.9748 187.2655 200.1840 210.8210 215.4918 234.1689 237.2639 255.9814 263.0580 278.2740 284.7996 299.8556 311.1609 326.2625 357.3497 378.5305 396.5997 410.1052 439.2514 442.0914 449.3297 458.3560 471.3018 476.9462 526.4972 534.3082 545.2915 570.3274 572.8736 592.9432 608.2602 623.6407 655.2417 666.3587 704.1970 716.7638 736.6170 743.8231 749.4886 794.4914 812.1717 828.3810 852.4460 863.6856 876.7010 886.1288 893.6863 908.4174 937.9443 952.5086 973.7082 983.6095 989.2518 993.0571 997.8461 1009.6144 1034.4989 1038.8537 1042.2477 1052.3759 1070.4180 1099.8361 1112.5011 1115.9881 1124.1751 1133.1465 1144.7392 1154.7136 1157.6114 1159.4281 1173.4997 1179.2478 1199.6548 1207.4917 1225.0539 1230.6072 1244.7283 1253.5199 1275.2102 1278.7956 1288.3605 1294.2848 1315.8436 1323.6635 1328.8779 1349.5697 1356.9419 1370.9545 1378.3957 1380.4582 1389.1054 1390.9528 1423.8450 1445.0446 1446.7841 1450.7072 1451.4768 1453.9585 1454.4887 1456.1523 1462.5066 1466.4367 1470.6928 1472.2475 1473.6046 1474.9982 1484.6723 1499.9549 1574.0966 1616.5529 1635.1768 1638.2595 1642.2876 2944.1548 2956.2430 2957.5984 2963.3202 2984.0128 2995.9412 2996.3057 3003.5591 3007.6711 3013.6415 3035.1486 3037.2342 3044.3136 3044.9816 3059.5820 3065.3785 3084.7177 3093.7108 3096.2200 3097.7465 3119.8090 3123.9937 3138.6164 3140.9232 3144.0942 3170.2549
redmass: 4.2674 4.3396 3.9413 3.9767 4.5044 2.6044 1.3798 6.3961 3.4936 3.6918 3.3993 1.5899 1.7562 1.4717 2.0074 1.8017 2.9866 2.6535 2.9609 2.1181 2.4475 3.0656 2.1202 3.2108 3.0804 3.1009 3.5962 3.7298 3.3640 3.8475 3.2757 3.3454 4.1774 4.5635 3.8566 4.4461 3.2837 4.3264 4.0661 3.2132 4.7361 3.0325 3.6239 3.5156 3.3084 5.6047 3.5372 4.9197 3.3080 3.6191 2.8027 2.3061 1.5640 2.0693 1.5729 2.2126 3.0194 5.1632 3.6716 1.6850 1.3771 1.9228 2.6552 2.0013 2.4087 2.1002 3.0238 2.2042 1.8602 1.6638 1.8829 2.1563 2.6138 1.2601 2.5072 2.6043 2.0717 2.1856 1.5694 1.6070 1.7842 1.4421 1.7337 2.5274 1.7093 1.5758 1.7734 2.4108 1.9194 2.2387 1.7314 1.4800 1.8796 1.5494 1.5630 1.5510 1.5817 1.8010 2.1467 2.9459 1.2472 1.2239 1.2091 2.1048 1.2850 1.2929 1.0855 1.1091 1.0620 1.0533 1.0797 1.0905 1.0501 1.0595 1.0854 1.0605 1.0658 1.0590 2.5784 7.5783 6.5188 10.0780 8.0989 9.0886 1.0687 1.0646 1.0332 1.0635 1.0599 1.0380 1.0360 1.0379 1.0606 1.0946 1.0914 1.0941 1.1038 1.1014 1.0850 1.1019 1.0982 1.0998 1.0990 1.0946 1.0995 1.0991 1.1023 1.0901 1.0878 1.0961
irintensity: 0.3300 0.4619 0.1235 1.8033 6.4608 1.4719 1.0052 0.2224 1.9116 2.6109 0.9361 2.6563 2.5315 0.2541 0.9321 0.5628 5.1961 1.1138 1.6557 0.9185 1.7595 1.8278 1.9788 0.4023 6.4736 6.0737 4.0351 1.0477 3.0179 7.1818 2.5136 2.3693 12.1661 0.6744 7.9976 2.6609 4.6139 0.9171 13.5632 5.5143 3.8386 2.6135 5.9688 0.2447 2.6592 3.8653 2.6523 1.3291 15.5831 6.2296 6.1155 10.5639 26.2369 9.0990 33.1118 2.5970 3.0006 74.2646 16.3546 9.8254 1.6617 30.1931 12.5828 4.9609 64.5648 19.9756 62.8974 14.5238 16.2833 13.3708 36.4446 15.4363 7.2471 0.2127 42.1108 8.6437 32.6738 58.2838 17.7253 2.8702 17.3288 16.9371 74.8904 298.9731 29.6723 2.7756 36.8713 63.7694 30.7219 12.7043 13.0510 48.8275 15.3433 12.2998 4.1943 2.6060 5.6501 10.2581 5.2479 26.3581 54.1252 18.4171 32.8086 21.8959 3.0254 0.2526 10.9695 7.8073 24.8155 20.0742 9.6138 18.3633 13.2267 16.9770 70.7297 8.6768 9.5235 9.8982 81.7807 5.8671 109.0549 167.4302 36.1599 151.1042 24.2676 32.9853 74.8100 28.4686 28.2850 7.0257 36.0064 2.0234 26.6215 20.2982 39.9709 30.0381 49.0793 13.9299 1.6465 22.9868 37.9461 23.6193 27.1052 9.0368 5.6447 30.4539 10.8742 20.8414 4.3012 9.4155
temp: 298.150 k
press: 1.00000 atm
elementType: 8 8 8 8 6 6 6 6 6 6 6 6 6 6 6 6 6 6 6 6 6 6 6 6 6 6 1 1 1 1 1 1 1 1 1 1 1 1 1 1 1 1 1 1 1 1 1 1 1 1 1 1
symmnumber: 1
zpe: 1127604.6 jmol-1
zpe.correction: 0.429482 hartree
zpe.thermalcorrener: 0.454205 hartree
zpe.thermalcorrenthalpy: 0.455149 hartree
zpe.thermalcorrgfe: 0.376391 hartree
zpe.sumelectzpe: -1152.917474 hartree
zpe.sumelectthermal: -1152.892751 hartree
zpe.sumelectthermalent: -1152.891807 hartree
zpe.sumelectthermalfe: -1152.970565 hartree
dipole: 3.0584 2.5360 4.4084
dipole: 5.9345
quadrupole: -139.2086 -154.4099 -159.0697
quadrupole: 3.2715 -4.5575 3.0086
quadrupole: 11.6874 -3.5138 -8.1736 3.2715 -4.5575 3.0086
hfenergy: -1153.346956 hartree
pointgroup: C01 [X(C22H26O4)]
dipole: 1.152092 1.013579 1.7597538 debye
polarizability: 349.3595463|-24.1161893|233.7994271|17.8783339|15.5719793|176.2055436 unknown
InChI: InChI=1S/C22H26O4/c1-13(23)26-22(3)10-9-21(2)18-8-5-14-11-15(25-4)6-7-16(14)17(18)12-19(22)20(21)24/h6-7,11,19H,5,8-10,12H2,1-4H3
charge 0 multiplicity 1
52 atoms
O  -3.933473 -0.426645 0.674162
O  -2.726657 1.001194 -2.174389
O  -4.555595 -2.261435 -0.655672
O  6.181376 -1.238682 -0.014068
C  -1.315268 1.765197 -0.29771
C  -1.859958 -0.711699 -0.65519
C  -2.460024 -0.821351 0.788489
C  -1.976669 1.683703 1.133497
C  -1.906613 0.265499 1.735286
C  0.169574 1.361573 -0.18008
C  -2.042369 0.716296 -1.158257
C  -0.346204 -1.059133 -0.756922
C  0.602749 0.070141 -0.371195
C  -1.517923 3.17329 -0.899094
C  1.176696 2.450986 0.179156
C  -2.345602 -2.225559 1.404422
C  2.048492 -0.261604 -0.270433
C  2.352262 1.893237 1.009457
C  2.94114 0.643856 0.376356
C  2.589177 -1.470353 -0.795039
C  4.318126 0.35259 0.477255
C  -4.833059 -1.1800 -0.088522
C  3.958898 -1.768493 -0.697608
C  4.831915 -0.854062 -0.060498
C  -6.173751 -0.478231 -0.141149
C  7.125782 -0.323437 0.629532
H  -2.426815 -1.398027 -1.306582
H  -3.032294 2.003203 1.048579
H  -1.464118 2.402746 1.80197
H  -0.858279 0.008242 1.972148
H  -2.47925 0.228376 2.680497
H  -0.150459 -1.348588 -1.810205
H  -0.123889 -1.963286 -0.157584
H  -1.118207 3.960495 -0.236631
H  -1.032607 3.26022 -1.886526
H  -2.594911 3.360503 -1.049097
H  1.560748 2.91876 -0.752678
H  0.684192 3.259929 0.749078
H  -2.668581 -3.004907 0.697532
H  -1.303113 -2.421647 1.712037
H  -2.977717 -2.287293 2.308401
H  1.977269 1.634586 2.023589
H  3.128868 2.668677 1.14503
H  1.937386 -2.188965 -1.301728
H  4.974768 1.069581 0.981385
H  4.37407 -2.693977 -1.107372
H  -6.13856 0.297757 -0.928053
H  -6.399882 0.019892 0.814844
H  -6.961773 -1.201906 -0.397928
H  6.873886 -0.167532 1.696893
H  7.1575 0.654315 0.110043
H  8.105246 -0.81733 0.549172
