program: Gaussian 09
title: 000253300
version: EM64L-G09RevD.01
frameworkgroup: C1[X(C15H14O5)]
method: RPBEPBE
basis: SDD
operation: Freq
keyword: #pfreq=noraman
keyword: PBEPBE/SDD
title: #p freq=noraman PBEPBE/SDD
converged: YES YES NO NO
title: Mulliken charges:
elementType: O O O O O C C C C C C C C C C C C C C C H H H H H H H H H H H H H H
charge: -0.346090 -0.395060 -0.460148 -0.266395 -0.424474 -0.649654 0.458004 0.004881 0.284805 -0.359748 -0.406031 0.227305 0.266495 -0.350135 -0.355813 0.317258 -0.584552 -0.589859 0.383640 -0.538152 0.242567 0.260023 0.265394 0.232922 0.249172 0.236211 0.255711 0.245151 0.376812 0.368726 0.367510 0.219515 0.219211 0.244796
chargesum: 0.00000
title: Mulliken charges with hydrogens summed into heavy atoms:
elementType: O O O O O C C C C C C C C C C C C C C C
charge: -0.346090 -0.018248 -0.091421 -0.266395 -0.056964 -0.147064 0.458004 0.004881 0.284805 -0.094354 -0.173109 0.227305 0.266495 -0.100962 -0.119602 0.317258 -0.328841 -0.344708 0.383640 0.145370
polarizability: 2.42894186e+02 -6.14973364e+00 1.90703008e+02 -9.32002704e+00 -1.43272391e+01 1.36703481e+02
1716.lowfreq: -8.1329 -2.4805 -0.0009 -0.0008 -0.0008 1.2610 16.8905 21.6333 47.8379
frequency: 16.8292 20.6529 47.7663 64.4758 93.6097 124.6530 149.5203 174.0069 202.3723 223.4191 231.0396 253.2872 290.3764 307.3691 313.8898 342.5936 373.5451 384.2342 388.6280 410.8633 416.4330 418.0815 441.0550 502.3671 510.5629 523.4193 549.6233 580.4043 596.2667 609.5633 620.6577 631.3006 641.4097 694.1379 714.5035 728.5666 777.8076 797.4012 807.7896 823.6593 830.7445 850.2661 933.4728 942.8446 974.4253 988.7409 990.1222 1004.5120 1010.9094 1031.1982 1039.9019 1110.5191 1112.3814 1134.8236 1155.7430 1158.9351 1174.5587 1180.0154 1183.7565 1194.2579 1228.1743 1229.2012 1267.6216 1282.0128 1310.8491 1333.3925 1382.0944 1390.7716 1401.8908 1418.2029 1435.2900 1435.9648 1455.0071 1466.1920 1472.9477 1491.3220 1499.6165 1563.4405 1584.0352 1600.8589 1620.9542 1648.2263 2433.5414 2956.2394 3021.2882 3042.6547 3123.1727 3123.2752 3137.2678 3139.4223 3151.5654 3160.1387 3161.4144 3167.2228 3569.0398 3581.5535
redmass: 6.7208 4.2506 4.8496 5.2119 4.7540 7.2718 5.5829 4.4316 5.7095 4.6132 1.2966 3.2922 4.3718 4.1655 5.0921 5.7093 2.5770 2.2433 2.2103 4.2941 1.4803 1.8941 5.3463 3.5984 6.1493 3.0124 5.9816 7.2313 3.5551 4.7302 3.8433 6.4893 4.0567 3.2330 4.0354 3.4532 4.0652 1.6268 1.8137 2.0198 2.0721 2.0408 1.5618 1.9404 1.3662 6.2222 5.7177 2.7488 3.3183 4.9199 1.0723 1.3956 1.2612 1.5438 1.3572 1.3211 1.6088 1.2472 1.2801 2.7517 2.1612 2.4048 2.5951 1.3350 1.3513 4.5404 5.3341 4.7290 6.4391 3.0922 2.2095 1.1796 1.2443 1.0502 1.0779 3.7912 2.4226 2.5922 6.6843 4.8207 6.3438 4.3641 1.0790 1.0331 1.0652 1.1038 1.0986 1.0964 1.0892 1.0874 1.0924 1.0928 1.0954 1.0962 1.0657 1.0660
irintensity: 0.4298 0.9804 0.4655 0.6442 2.9713 1.7133 2.0633 0.4300 3.9552 0.8122 0.5516 9.8407 4.1904 11.6566 5.7051 8.5192 7.6490 23.5181 36.1731 1.2149 116.4052 88.8680 4.3809 7.3061 8.8156 11.5465 30.6665 18.3460 0.6665 25.6365 20.2684 1.2766 7.2275 28.3043 15.4592 9.7578 34.6074 4.4074 26.5128 18.7259 61.9241 29.6203 3.3298 8.2996 2.5742 38.2430 52.4994 17.0570 59.6558 51.9916 139.8504 5.6683 0.2702 365.0805 4.5886 15.2122 9.3400 58.6315 93.8363 14.2803 208.5078 102.1543 14.4553 13.2731 2.7217 230.5681 10.6701 38.7153 10.9585 9.6909 119.1947 16.1766 37.8255 12.7961 61.7861 211.4528 104.4861 13.8241 9.5994 227.9427 51.2999 678.2408 456.3962 70.6134 16.4960 50.8872 23.3765 6.0274 1.8570 12.0690 2.6701 3.4547 17.0210 3.5769 40.9989 71.7435
temp: 298.150 k
press: 1.00000 atm
elementType: 8 8 8 8 8 6 6 6 6 6 6 6 6 6 6 6 6 6 6 6 1 1 1 1 1 1 1 1 1 1 1 1 1 1
symmnumber: 1
zpe: 676405.3 jmol-1
zpe.correction: 0.257629 hartree
zpe.thermalcorrener: 0.275639 hartree
zpe.thermalcorrenthalpy: 0.276583 hartree
zpe.thermalcorrgfe: 0.210091 hartree
zpe.sumelectzpe: -954.664588 hartree
zpe.sumelectthermal: -954.646579 hartree
zpe.sumelectthermalent: -954.645634 hartree
zpe.sumelectthermalfe: -954.712126 hartree
dipole: 0.3951 -5.4059 1.3850
dipole: 5.5945
quadrupole: -100.4487 -114.0967 -112.1392
quadrupole: 2.8442 -4.9299 -2.1550
quadrupole: 8.4462 -5.2018 -3.2443 2.8442 -4.9299 -2.1550
hfenergy: -954.9222172 hartree
pointgroup: C01 [X(C15H14O5)]
dipole: -0.3256133 0.7930201 2.0272267 debye
polarizability: 242.0687693|-14.1280511|141.636958|5.5916046|19.6880836|186.5949475 unknown
InChI: InChI=1S/C15H14O5/c1-20-11-4-2-9(3-5-11)6-12(17)15-13(18)7-10(16)8-14(15)19/h2-5,7-8,16,18-19H,6H2,1H3
charge 0 multiplicity 1
34 atoms
O  -0.6998 -1.600715 -2.21707
O  -2.561968 -0.103629 -2.758445
O  -1.239414 -0.668574 1.9207
O  5.065537 1.314541 0.043918
O  -4.86677 2.25982 0.772551
C  0.321893 -1.986945 -0.080558
C  1.565182 -1.090545 -0.010714
C  -1.801466 -0.436721 -0.446724
C  -0.759191 -1.341846 -0.939261
C  2.287139 -0.7690 -1.193255
C  2.032654 -0.579598 1.221054
C  -2.691268 0.176419 -1.428972
C  -2.042518 -0.086435 0.92749
C  3.441824 0.0304 -1.141778
C  3.194813 0.224594 1.292138
C  3.901279 0.529917 0.103546
C  -3.712898 1.076488 -1.0491
C  -3.058044 0.803526 1.307386
C  -3.883112 1.382527 0.311351
C  5.578934 1.855944 1.303096
H  0.576231 -2.937846 -0.582878
H  -0.04893 -2.195813 0.931506
H  1.933239 -1.15131 -2.15753
H  1.481256 -0.810185 2.138864
H  4.004833 0.279675 -2.046463
H  3.532361 0.5982 2.263749
H  -4.342979 1.505753 -1.834418
H  -3.23504 1.065064 2.356019
H  -1.761308 -0.795848 -2.836811
H  -1.508895 -0.335741 2.813326
H  -5.399672 2.623946 0.022311
H  5.857159 1.047055 2.007088
H  4.841226 2.527598 1.784673
H  6.475612 2.429383 1.025511
