program: Gaussian 09
title: 000253299
version: EM64L-G09RevD.01
frameworkgroup: C1[X(C14H11FN2O2)]
method: RPBEPBE
basis: SDD
operation: Freq
keyword: #p
keyword: freq=noraman
keyword: PBEPBE/SDD
title: #p freq=noraman PBEPBE/SDD
converged: YES YES NO NO
title: Mulliken charges:
elementType: F O O N N C C C C C C C C C C C C C C H H H H H H H H H H H
charge: -0.173958 -0.276260 -0.319728 -0.322816 -0.344429 0.149438 0.273044 0.177766 0.196222 -0.343896 0.207603 -0.341216 -0.336284 -0.355145 -0.236238 -0.187029 -0.218751 -0.235526 -0.224610 0.259733 0.276941 0.213528 0.362842 0.354556 0.261285 0.238955 0.240492 0.234520 0.233897 0.235065
chargesum: 0.00000
title: Mulliken charges with hydrogens summed into heavy atoms:
elementType: F O O N N C C C C C C C C C C C C C C
charge: -0.173958 -0.276260 -0.319728 0.040026 0.010127 0.149438 0.273044 0.177766 0.196222 -0.084163 0.207603 -0.064275 -0.122757 -0.093860 0.002716 0.053464 0.015768 -0.001629 0.010455
polarizability: 3.07478164e+02 5.78737124e+00 1.64943883e+02 -3.17700769e-01 -6.19398055e+00 8.56602851e+01
1716.lowfreq: 0.0005 0.0008 0.0010 3.3106 4.3015 5.6314 15.5601 30.3329 38.4902
frequency: 15.3802 30.2736 38.4826 44.6963 98.6589 105.2144 128.6489 168.8265 183.8222 226.9786 240.3775 294.6858 311.5257 363.9449 380.5013 397.4890 428.5304 450.6087 461.3536 503.9016 525.1796 560.8359 584.4036 607.8700 614.3023 647.1239 664.7698 673.7906 696.9380 697.8022 753.7523 770.1190 777.0463 790.4220 817.0041 851.5202 869.1768 920.4475 936.0474 951.6529 986.5545 987.6795 989.4796 1009.2514 1022.5112 1031.8015 1038.5888 1076.8283 1093.0403 1121.1455 1173.7499 1174.4159 1187.8119 1196.2028 1211.0585 1232.1736 1264.5023 1286.4878 1324.9289 1379.1773 1387.2755 1403.7030 1429.9863 1436.1343 1476.9254 1484.9996 1524.3765 1531.7434 1570.3816 1590.3534 1602.9577 1613.2293 1617.7605 3124.7978 3135.1718 3137.8892 3148.4488 3150.1385 3161.0038 3167.9880 3171.9871 3182.2303 3487.5014 3508.6141
redmass: 4.0254 6.4934 7.9277 6.1860 7.5602 6.6479 5.3955 6.4581 7.5191 5.9148 6.3774 7.2670 7.5621 7.3106 6.2118 2.7604 5.5459 4.1726 4.5255 4.2494 6.9653 4.6458 1.2884 1.1619 6.3585 6.2661 6.2717 5.4523 2.1043 2.1438 4.0229 1.3196 6.9409 2.2042 7.1684 1.2573 1.4326 5.8478 1.4318 1.3730 1.3914 1.3310 5.9524 1.3383 2.7776 2.5824 2.5518 2.1579 1.9202 1.8339 1.0794 1.0618 2.1152 1.3788 3.2387 1.7093 1.5542 2.2198 1.3679 8.8582 8.5640 3.0974 2.3142 2.3221 2.5488 2.4671 2.4686 9.1409 6.4880 7.1221 6.7226 5.9481 7.3341 1.0869 1.0875 1.0874 1.0922 1.0902 1.0958 1.0953 1.1009 1.0994 1.0796 1.0791
irintensity: 0.1790 1.0889 1.6253 3.4766 6.5192 3.6874 0.4404 1.3900 0.8700 10.8571 16.3147 3.3716 4.0309 0.6263 16.6805 0.6384 4.1627 5.1370 5.0573 12.4263 7.4034 9.6583 53.0603 130.4521 0.7410 14.3001 7.9723 23.4129 63.0350 49.8390 8.8492 83.4057 12.9720 28.1745 9.6280 0.1911 1.3635 1.4590 4.1580 3.1406 0.4750 0.1329 0.6609 0.7556 9.5845 8.7661 4.4208 45.4047 3.8697 7.2643 1.4897 1.6846 19.9814 16.3394 1.8988 11.5724 9.3404 0.7116 2.5408 38.2027 11.8231 888.5644 14.0447 30.8641 46.0380 96.8602 25.1401 319.0206 4.5568 63.8217 4.0050 11.5304 31.4318 9.5256 2.0848 1.8597 20.9830 7.0846 13.6915 12.4762 22.8298 8.4557 37.4104 130.8684
temp: 298.150 k
press: 1.00000 atm
elementType: 9 8 8 7 7 6 6 6 6 6 6 6 6 6 6 6 6 6 6 1 1 1 1 1 1 1 1 1 1 1
symmnumber: 1
zpe: 582683.6 jmol-1
zpe.correction: 0.221932 hartree
zpe.thermalcorrener: 0.238161 hartree
zpe.thermalcorrenthalpy: 0.239105 hartree
zpe.thermalcorrgfe: 0.175234 hartree
zpe.sumelectzpe: -898.552598 hartree
zpe.sumelectthermal: -898.536370 hartree
zpe.sumelectthermalent: -898.535425 hartree
zpe.sumelectthermalfe: -898.599296 hartree
dipole: 0.1270 -1.7273 -0.7392
dipole: 1.8831
quadrupole: -71.0929 -114.4581 -112.7379
quadrupole: 17.1838 -1.0095 1.1383
quadrupole: 28.3367 -15.0285 -13.3082 17.1838 -1.0095 1.1383
hfenergy: -898.7745301 hartree
pointgroup: C01 [X(C14H11F1N2O2)]
dipole: -0.0557131 0.6813494 -0.2855704 debye
polarizability: 307.3460874|7.1639232|164.9671562|1.0368311|6.8556661|85.7690892 unknown
InChI: InChI=1S/C14H11FN2O2/c15-12-9-5-4-8-11(12)14(19)17-16-13(18)10-6-2-1-3-7-10/h1-9,16-17H
charge 0 multiplicity 1
30 atoms
F  3.704227 -2.028425 1.074257
O  1.217853 -1.838247 -0.49001
O  -1.552891 1.884183 0.652478
N  0.474237 0.262074 0.089752
N  -0.842366 -0.188564 -0.026798
C  2.872426 -0.054345 -0.07909
C  -3.264333 0.206684 0.144727
C  1.495526 -0.63614 -0.172029
C  3.945774 -0.775103 0.495887
C  3.165452 1.228185 -0.617864
C  -1.858822 0.699848 0.275868
C  -4.293484 1.070805 0.599846
C  -3.609327 -1.054578 -0.411132
C  5.257021 -0.274405 0.548089
C  4.473566 1.755086 -0.57742
C  5.520319 1.002279 0.004277
C  -5.644663 0.679178 0.510369
C  -4.962374 -1.444087 -0.499577
C  -5.983367 -0.580369 -0.037694
H  2.364996 1.798928 -1.10185
H  -4.003958 2.04121 1.015779
H  -2.843664 -1.739007 -0.795412
H  0.54632 1.22126 0.448207
H  -0.905797 -1.179228 -0.28164
H  6.042833 -0.877217 1.012093
H  4.677001 2.741158 -1.006248
H  6.538413 1.403473 0.034623
H  -6.432087 1.352365 0.865869
H  -5.220558 -2.416872 -0.931433
H  -7.032975 -0.886133 -0.108324
