program: Gaussian 09
title: 000253288
version: EM64L-G09RevD.01
frameworkgroup: C1[X(C9H11N3)]
method: RPBEPBE
basis: SDD
operation: Freq
keyword: #pfreq=noraman
keyword: PBEPBE/SDD
title: #p freq=noraman PBEPBE/SDD
converged: NO NO NO NO
title: Mulliken charges:
elementType: N N N C C C C C C C C C H H H H H H H H H H H
charge: -0.256736 -0.129741 -0.117534 -0.481314 0.235072 -0.363827 0.180211 -0.197153 -0.678227 -0.310495 -0.227126 -0.185258 0.250388 0.205335 0.201298 0.233165 0.254485 0.219122 0.206545 0.226200 0.260021 0.232533 0.243038
chargesum: 0.00000
title: Mulliken charges with hydrogens summed into heavy atoms:
elementType: N N N C C C C C C C C C
charge: -0.256736 -0.129741 -0.117534 -0.025591 0.235072 0.070635 0.180211 0.057332 -0.026360 -0.050474 0.005406 0.057780
polarizability: 1.53308863e+02 -1.11051199e+01 1.26547732e+02 9.09232130e+00 3.60025948e+00 6.44245646e+01
1716.lowfreq: -11.7593 -4.9785 -0.0009 -0.0006 -0.0005 8.9398 57.0942 74.2825 78.9931
frequency: 56.9718 74.2416 78.9909 193.4096 209.3226 221.7826 243.3568 300.3997 377.4060 426.5884 463.2512 542.8538 578.3060 603.1426 666.9017 722.5830 738.3330 746.1817 752.7650 771.0894 836.4924 859.9119 887.9166 892.8301 931.0911 976.2718 986.2633 999.8655 1037.3728 1056.0454 1081.3986 1092.9793 1129.9678 1158.8920 1212.3413 1252.5693 1270.7472 1281.2731 1300.2493 1317.5377 1342.0547 1368.9050 1391.9806 1427.2274 1452.4441 1465.9877 1474.8533 1477.7241 1486.0205 1501.1453 1520.6343 1628.2198 2970.6256 2975.7627 2983.9165 3036.0280 3065.3727 3077.4525 3080.5688 3157.8012 3171.3663 3188.8771 3195.9784
redmass: 3.5570 1.6098 3.7074 3.7461 5.5738 1.2659 2.1422 3.0581 5.4023 2.8517 4.5340 6.3928 3.8215 5.6529 7.1127 2.3410 1.9095 1.4405 2.4415 5.5209 1.4517 1.4279 2.0071 5.5462 1.3380 1.2993 5.7530 2.6085 3.4443 2.7252 2.0537 2.0970 1.4340 1.3837 1.6939 2.6541 1.4628 1.3126 1.3977 1.8862 1.4380 2.7439 1.2111 2.7196 1.4272 2.7051 1.0739 1.0432 1.0901 4.3614 6.5762 6.4342 1.0656 1.0364 1.0638 1.0964 1.0966 1.0999 1.0997 1.0874 1.0896 1.0967 1.1010
irintensity: 1.4887 0.3006 0.0056 0.6775 2.3481 0.3465 1.2451 0.4107 2.3544 10.8946 1.5565 2.2802 0.9854 2.3355 4.0647 2.5369 8.1330 91.0965 2.3622 5.3206 4.2625 2.3798 7.1040 1.0705 0.2606 0.4344 8.4825 4.8450 5.1640 2.6734 2.9385 12.4299 6.5075 2.2946 1.6826 17.6832 1.7526 0.3721 13.6470 5.7910 0.9789 29.3071 11.7840 5.9328 4.5083 10.3613 3.8067 13.7966 18.4132 6.6371 0.4555 5.8952 14.4541 44.8505 33.1318 2.6027 6.1143 59.2003 44.5716 4.4895 3.2204 6.4131 7.0937
temp: 298.150 k
press: 1.00000 atm
elementType: 7 7 7 6 6 6 6 6 6 6 6 6 1 1 1 1 1 1 1 1 1 1 1
symmnumber: 1
zpe: 489098.2 jmol-1
zpe.correction: 0.186288 hartree
zpe.thermalcorrener: 0.196771 hartree
zpe.thermalcorrenthalpy: 0.197716 hartree
zpe.thermalcorrgfe: 0.149542 hartree
zpe.sumelectzpe: -512.911064 hartree
zpe.sumelectthermal: -512.900580 hartree
zpe.sumelectthermalent: -512.899636 hartree
zpe.sumelectthermalfe: -512.947810 hartree
dipole: -0.3881 -6.1238 -0.4684
dipole: 6.1539
quadrupole: -59.5484 -80.9156 -73.0083
quadrupole: -3.7282 1.4640 0.4289
quadrupole: 11.6091 -9.7582 -1.8509 -3.7282 1.4640 0.4289
hfenergy: -513.0973515 hartree
pointgroup: C01 [X(C9H11N3)]
dipole: 0.0576671 -2.4204462 -0.0008321 debye
dipolederiv: -0.1387389 0.3218834 -0.0577906 -0.1317997 -0.5356259 -0.0109023 -0.0339281 0.0828149 0.0506378 -0.0714129 -0.2553209 0.0404284 0.0206415 -0.0568721 -0.0107284 0.0346911 -0.0580854 -0.2426734 -0.4570989 0.1457462 -0.0057324 -0.3017346 -0.2637286 -0.0464558 -0.0391033 0.0277339 -0.2364726 0.0240828 0.0566738 0.0061567 0.1180137 0.0729485 -0.0592032 0.1297656 -0.051129 0.1193796 0.4598065 -0.0520525 0.0586218 -0.0436281 -0.0015153 0.0097606 0.0976759 -0.0317311 -0.0015011 0.0486954 0.0102987 -0.0324669 0.0371095 0.1309861 0.0257054 -0.1602927 0.0072629 0.0781114 -0.1067066 -0.1165879 -0.0226697 0.3280114 0.3892934 0.0244479 -0.0570441 -0.0286221 0.0939764 0.108414 0.0234871 0.0298224 0.136427 0.1931822 0.0186546 0.0328818 -0.0067461 -0.0846532 -0.0557541 0.0537068 -0.0021214 0.0803599 0.0743827 -0.0155182 0.0803049 -0.0160076 0.0636227 0.0887066 -0.0176107 0.0392386 -0.057098 0.0373459 -0.0174635 0.0445484 -0.0069547 -0.1134184 -0.0622235 0.0147881 0.0171513 -0.0810318 0.0766219 -0.0264973 0.0300033 -0.0053098 -0.1716522 0.0566884 -0.062241 0.0521539 0.0304903 -0.0424473 0.0001765 0.0372762 -0.0165117 -0.1434607 0.0097662 -0.051557 -0.0377419 -0.0938387 0.0007175 -0.0740873 -0.019192 -0.0353951 0.0608044 0.0111371 -0.0127802 0.0290546 0.0576679 -0.0282986 0.1460093 -0.002182 0.0807116 -0.0462169 -0.0536601 -0.0960588 -0.0628536 -0.1010329 -0.0513301 -0.0927475 -0.0507944 -0.0511451 0.0230778 0.0566443 0.0330368 0.0097007 0.0009552 -0.034637 0.1197311 0.0066849 0.0831176 -0.0472127 0.0086233 0.0770807 -0.038023 0.0445909 0.0430861 0.0076133 -0.0434953 0.0163827 0.1672785 -0.0138448 -0.0646057 -0.05164 -0.1342265 -0.0541122 -0.072903 -0.092405 -0.0595581 0.0599484 0.0638184 -0.0304902 0.0290169 0.0148679 -0.0469841 0.1330126 -0.0315914 0.146285 -0.0436453 -0.0359871 0.0601491 0.0820367 0.0926122 0.0537731 -0.0772943 0.1230156 -0.0879267 -0.074664 0.0322784 0.0376904 -0.0276806 0.0742585 0.0496159 0.0192846 -0.0300036 0.0122417 0.1653103 0.0972272 -0.0192803 -0.0122556 -0.0227726 -0.0792629 0.0083248 -0.0133959 0.0067387 0.1648519 -0.0704618 -0.0559557 -0.0424063 -0.0688428 0.0728609 -0.0089198 -0.04342 -0.0081665 0.1585711 unknown
polarizability: 153.9528992|9.2941212|125.9594797|10.5234918|0.8652443|64.3687797 unknown
InChI: InChI=1S/C9H11N3/c1-2-5-8-10-11-9-6-3-4-7-12(8)9/h3-4,6-7H,2,5H2,1H3
charge 0 multiplicity 1
23 atoms
N  -0.35011 -0.091765 0.19381
N  0.480477 1.99468 0.28131
N  -0.900644 2.117629 0.003936
C  2.16794 0.126547 0.660071
C  0.801548 0.677616 0.393938
C  2.859817 -0.476358 -0.598141
C  -1.401339 0.848402 -0.047854
C  -0.578675 -1.464892 0.210752
C  4.270024 -1.012312 -0.274262
C  -2.718898 0.362257 -0.285129
C  -1.862956 -1.931375 -0.01772
C  -2.945825 -1.013547 -0.270789
H  2.782143 0.959392 1.044843
H  2.127308 -0.642363 1.459274
H  2.238162 -1.290954 -1.020416
H  2.920626 0.307942 -1.375513
H  0.276495 -2.114287 0.40887
H  4.918641 -0.206767 0.117292
H  4.229396 -1.812285 0.489455
H  4.75487 -1.428744 -1.175396
H  -3.515064 1.08712 -0.470324
H  -2.041461 -3.009724 -0.003283
H  -3.951372 -1.404912 -0.451024
