program: Gaussian 09
title: 000253287
version: EM64L-G09RevD.01
frameworkgroup: C1[X(C7H8N4)]
method: RPBEPBE
basis: SDD
operation: Freq
keyword: #p
keyword: freq=noraman
keyword: PBEPBE/SDD
title: #p freq=noraman PBEPBE/SDD
converged: NO YES NO NO
title: Mulliken charges:
elementType: N N N N C C C C C C C H H H H H H H H
charge: -0.210629 -0.112554 -0.090930 -0.627917 0.051607 0.360648 -0.207027 0.053583 -0.345404 -0.200677 -0.771186 0.277781 0.244222 0.230524 0.213558 0.249202 0.249008 0.318012 0.318180
chargesum: 0.00000
title: Mulliken charges with hydrogens summed into heavy atoms:
elementType: N N N N C C C C C C C
charge: -0.210629 -0.112554 -0.090930 0.008274 0.051607 0.360648 0.070754 0.053583 -0.101182 0.029847 -0.059418
polarizability: 1.35558794e+02 4.64640682e+00 1.16127806e+02 3.48118582e-03 -2.04787112e-02 4.94324903e+01
1716.lowfreq: -199.6032 -0.0008 -0.0008 0.0003 3.1407 14.4319 16.1150 94.3575 121.9528
frequency: -199.5951 94.3563 121.9431 192.3373 216.2650 252.1295 304.7703 321.9356 493.2650 517.6292 518.6467 561.7075 576.9570 598.6549 643.6399 687.5236 742.6024 755.3628 786.1452 865.7056 892.2075 942.2960 957.2574 998.8727 1015.9472 1047.3984 1072.9686 1152.1052 1157.1529 1160.4998 1231.7161 1263.3966 1291.5930 1352.8394 1399.7094 1426.4428 1451.8438 1458.7490 1485.0203 1494.7902 1556.5203 1620.0898 1641.9309 2988.4624 3068.8412 3100.7630 3147.5548 3173.0603 3198.6867 3491.2994 3603.7054
redmass: 1.0666 1.0560 3.6742 4.1922 3.4462 3.7021 3.3455 4.0062 4.6820 2.4027 3.6959 4.4363 3.5812 2.2958 7.5701 6.4943 7.0053 3.0956 1.6170 5.0567 1.3268 3.2617 1.3044 3.4395 4.2231 1.5286 1.7605 1.5501 1.3072 3.8105 4.7736 2.3809 2.7153 2.8114 1.2557 2.7424 1.0440 1.6687 3.6384 3.4756 6.1397 6.1341 1.0932 1.0363 1.0966 1.1008 1.0902 1.0904 1.0996 1.0448 1.0992
irintensity: 35.4550 1.5590 5.7074 0.4394 3.8482 1.9493 6.9324 3.0579 19.3815 58.9490 0.0236 0.9782 0.9860 134.9986 0.2963 8.8802 3.4015 29.6880 54.6017 6.3846 0.1555 0.1627 0.6148 10.7432 3.8199 9.4560 15.4817 0.1051 2.6472 7.7909 5.1973 3.4982 14.4210 50.1838 22.3837 11.3883 14.3803 0.0283 71.6447 41.8935 17.8676 8.0244 34.5229 17.1668 10.8853 18.6783 11.8695 5.1934 6.7206 12.3717 22.2474
temp: 298.150 k
press: 1.00000 atm
elementType: 7 7 7 7 6 6 6 6 6 6 6 1 1 1 1 1 1 1 1
symmnumber: 1
zpe: 383375.0 jmol-1
zpe.correction: 0.146020 hartree
zpe.thermalcorrener: 0.154875 hartree
zpe.thermalcorrenthalpy: 0.155820 hartree
zpe.thermalcorrgfe: 0.112130 hartree
zpe.sumelectzpe: -489.735776 hartree
zpe.sumelectthermal: -489.726921 hartree
zpe.sumelectthermalent: -489.725976 hartree
zpe.sumelectthermalfe: -489.769666 hartree
dipole: 0.4053 4.7893 -0.0032
dipole: 4.8064
quadrupole: -48.5885 -70.9354 -64.3185
quadrupole: -5.3208 0.0180 -0.0398
quadrupole: 12.6923 -9.6546 -3.0377 -5.3208 0.0180 -0.0398
hfenergy: -489.8817961 hartree
pointgroup: C01 [X(C7H8N4)]
dipole: 0.3653032 1.8528731 0.0960278 debye
dipolederiv: -0.2508094 0.2555554 0.0067721 -0.2280467 -0.4788429 -0.0320484 -0.0156503 -0.023402 0.0795133 -0.5251688 0.1372407 0.001572 -0.2877755 -0.28943 -0.0074444 -0.0202017 0.0018645 -0.2570963 -0.1209647 -0.1993808 -0.0070801 0.0247578 -0.0812413 0.008474 0.0027739 0.0041203 -0.2392183 -0.7213429 0.0033083 -0.0113669 0.1714708 -0.6959054 -0.0273799 -0.0027924 -0.0297668 -0.1585995 -0.024282 0.1094655 0.0033402 0.4520349 0.2860538 0.0194547 0.0201912 0.0126168 0.0710859 0.1719294 -0.1995697 -0.0062635 -0.2794698 0.2716263 0.0071639 -0.0091583 0.0081344 0.0049327 0.0593916 0.0097994 0.0033179 0.1569552 0.1145607 0.0137149 0.0102448 0.01117 -0.101331 1.0084684 -0.2713947 0.0052053 -0.1619931 0.274511 0.0117899 0.011968 0.0084177 0.0019163 0.0260153 -0.0848693 -0.0004111 0.180052 -0.1340354 0.0056047 0.0124306 0.0006297 -0.1737315 0.0122602 0.0571831 0.0061105 -0.0996262 0.0979683 0.0107541 -0.0013094 0.0138197 -0.163241 0.0504597 0.0577572 0.0025667 0.1580883 -0.153712 -0.0062631 0.0063961 -0.0072514 0.0409783 0.0736182 0.0664931 0.0009683 0.0164958 0.0442052 -0.0068959 -0.0014885 -0.0060688 0.1904851 -0.1054391 -0.0247449 -0.0061672 -0.0121272 0.0933758 -0.0034824 -0.0055303 -0.0036357 0.1587621 0.0781774 -0.0553357 -0.0043332 -0.0457333 -0.0783067 -0.0127373 -0.0039076 -0.0129078 0.1645786 -0.1433701 -0.0001196 -0.0040338 -0.1129055 0.0551852 -0.0044121 -0.0093962 -0.0027511 0.1105249 0.074453 0.0082447 -0.0526358 0.0229431 0.0403127 -0.080387 -0.0007443 -0.1030013 -0.0281643 0.0721686 0.0001912 0.0559774 0.0202459 0.0225138 0.0857759 0.0060737 0.1076293 -0.0094858 0.1322849 0.0686197 -0.0401061 0.0136794 0.3128228 -0.0755036 -0.0161561 -0.0251416 0.1455425 0.1321504 0.0615564 0.0465672 0.0109541 0.298338 0.0938219 0.0162571 0.0455239 0.1625478 unknown
polarizability: 136.3074712|2.330902|115.1892241|1.7617225|3.2298843|49.6223941 unknown
InChI: InChI=1S/C7H8N4/c1-5-3-2-4-11-6(5)9-10-7(11)8/h2-4H,8H2,1H3
charge 0 multiplicity 1
19 atoms
N  -0.564963 0.531471 0.000583
N  -0.419523 -1.739982 -0.10798
N  -1.780615 -1.363866 -0.116428
N  -3.006713 0.807489 -0.03043
C  0.311374 -0.580618 -0.037135
C  1.729853 -0.372537 -0.000054
C  -0.116253 1.843492 0.073227
C  -1.86435 -0.007268 -0.05009
C  2.173821 0.951395 0.072667
C  1.251421 2.058789 0.109326
C  2.645582 -1.571956 -0.039951
H  -0.886411 2.616831 0.097014
H  3.249672 1.153207 0.102724
H  1.624274 3.084799 0.166402
H  3.704684 -1.266872 -0.008897
H  2.470016 -2.167184 -0.954378
H  2.441624 -2.246996 0.810991
H  -3.547831 0.849212 -0.896581
H  -3.58606 0.753294 0.80989
