program: Gaussian 09
title: 000253286
version: EM64L-G09RevD.01
frameworkgroup: C1[X(C6H6N4)]
method: RPBEPBE
basis: SDD
operation: Freq
keyword: #p
keyword: freq=noraman
keyword: PBEPBE/SDD
title: #p freq=noraman PBEPBE/SDD
converged: NO NO NO NO
title: Mulliken charges:
elementType: N N N N C C C C C C H H H H H H
charge: -0.224828 -0.116191 -0.090029 -0.627206 0.200802 0.060928 -0.189835 -0.277857 -0.213053 -0.174472 0.279242 0.259630 0.233202 0.242347 0.318680 0.318637
chargesum: 0.00000
title: Mulliken charges with hydrogens summed into heavy atoms:
elementType: N N N N C C C C C C
charge: -0.224828 -0.116191 -0.090029 0.010112 0.200802 0.060928 0.089408 -0.018226 0.020150 0.067875
polarizability: 1.26191907e+02 -3.36181850e+00 9.67037355e+01 6.36343570e-03 7.42437362e-04 3.99103959e+01
1716.lowfreq: -176.3154 -12.1187 -0.0015 -0.0012 -0.0011 11.9949 16.6573 159.3024 207.9348
frequency: -176.2994 159.2951 207.9334 255.2977 321.7466 431.7966 495.1363 532.8909 578.0583 591.4448 624.5531 637.9584 730.8901 752.9129 760.9414 768.6052 852.5911 889.2507 946.3349 978.9079 997.9976 1002.0932 1071.1587 1126.1016 1152.8742 1159.0674 1234.9164 1253.8553 1303.0637 1358.6363 1428.7918 1482.1196 1494.5439 1522.2056 1625.7740 1644.4492 3157.2431 3174.0983 3189.7623 3197.8640 3483.9484 3595.0839
redmass: 1.0766 3.7404 5.5829 4.1408 3.9568 2.9405 3.5551 3.6646 3.6228 4.5235 2.2392 7.2812 6.5533 3.9845 1.4093 6.3637 1.4285 7.6392 1.3334 1.2909 2.2215 11.2071 4.3265 1.5138 1.4887 1.3017 4.3331 2.4041 1.8594 3.0286 2.7607 6.8506 5.0497 6.4712 6.4344 1.0921 1.0879 1.0896 1.0965 1.1009 1.0449 1.0990
irintensity: 37.3258 1.6671 0.5298 7.0067 3.0737 11.0716 24.3201 45.8111 1.2915 35.9861 119.5525 1.9993 0.3447 7.7079 103.2820 2.1153 0.0002 3.8739 1.3295 0.0887 5.4593 12.4533 7.3063 6.6593 0.5232 2.3729 3.1990 9.8229 15.2119 54.1747 6.2303 72.4897 27.9722 4.2792 9.8884 34.7394 6.4860 2.8236 2.4647 9.2384 12.6498 22.5688
temp: 298.150 k
press: 1.00000 atm
elementType: 7 7 7 7 6 6 6 6 6 6 1 1 1 1 1 1
symmnumber: 1
zpe: 312059.0 jmol-1
zpe.correction: 0.118857 hartree
zpe.thermalcorrener: 0.125888 hartree
zpe.thermalcorrenthalpy: 0.126832 hartree
zpe.thermalcorrgfe: 0.087296 hartree
zpe.sumelectzpe: -450.503593 hartree
zpe.sumelectthermal: -450.496562 hartree
zpe.sumelectthermalent: -450.495618 hartree
zpe.sumelectthermalfe: -450.535154 hartree
dipole: 1.9969 -4.9916 0.0019
dipole: 5.3762
quadrupole: -47.4360 -61.9277 -58.2601
quadrupole: 9.8538 -0.0024 -0.0045
quadrupole: 8.4386 -6.0531 -2.3855 9.8538 -0.0024 -0.0045
hfenergy: -450.6224504 hartree
pointgroup: C01 [X(C6H6N4)]
dipole: -1.0224882 -1.8459551 -0.144549 debye
dipolederiv: -0.2403268 0.1516541 -0.0031592 -0.3559782 -0.5183831 -0.0476652 -0.032288 -0.0287645 0.0792097 -0.5022797 0.242945 0.0050755 -0.1689183 -0.2483381 -0.0055302 -0.0185541 0.0096949 -0.2619759 -0.1789301 -0.1761515 -0.0079192 0.096248 -0.0222464 0.0157433 0.0080707 0.0056888 -0.2376934 -0.6457853 -0.0265704 -0.0191248 0.1546363 -0.7493391 -0.0279601 -0.008479 -0.0349184 -0.160203 0.2181872 0.0553506 0.0075133 0.4826366 0.1567027 0.0209984 0.0319547 0.0052311 0.1021847 0.7042129 -0.4493472 -0.000105 -0.3845308 0.5171921 0.0158361 0.0031838 0.0137023 -0.0005164 0.1654877 -0.0189368 0.0080673 0.1399157 0.1125876 0.0162913 0.0170801 0.0104137 -0.0789478 -0.0158915 -0.042407 0.0014323 -0.0827143 0.0723861 0.008017 -0.0009458 0.0095172 -0.119422 -0.0369981 0.1320164 0.0128491 -0.0131237 0.0361065 0.0118966 0.00453 0.0172183 -0.178189 0.0412549 -0.1103422 0.0007567 0.0175899 0.047848 0.011954 0.0081083 0.0072446 -0.1488992 0.0997894 0.0429611 -0.0008 -0.0061899 0.0197633 -0.0098943 -0.003641 -0.008115 0.1874102 0.0888586 0.013487 -0.002334 0.0518941 -0.0107232 -0.0086288 -0.0001391 -0.0100686 0.1723607 0.0226655 -0.090685 -0.0106062 -0.0881649 -0.0089431 -0.013453 -0.0104513 -0.0135454 0.1674509 -0.0895666 0.0484742 -0.0066649 0.0374759 0.0870233 -0.0031133 -0.0072973 -0.0027015 0.1649663 0.1885163 0.1188402 -0.0661188 0.0635919 0.259353 -0.0559395 -0.0234065 -0.0170417 0.1473687 0.1808056 0.1087115 0.0811379 0.0556317 0.2490105 0.0714477 0.0322743 0.0364441 0.1648956 unknown
polarizability: 126.4476904|-0.5541741|96.1464331|3.1697333|3.2087037|40.211915 unknown
InChI: InChI=1S/C6H6N4/c7-6-9-8-5-3-1-2-4-10(5)6/h1-4H,7H2
charge 0 multiplicity 1
16 atoms
N  0.15942 -0.45346 0.008843
N  0.902737 1.698452 0.159463
N  2.008089 0.822803 0.150247
N  2.303054 -1.65468 0.01835
C  -0.220132 0.914236 0.073076
C  1.563156 -0.461384 0.06013
C  -0.762605 -1.486254 -0.084575
C  -1.605691 1.243743 0.040694
C  -2.111022 -1.165029 -0.116224
C  -2.539365 0.210838 -0.053128
H  -0.348519 -2.495871 -0.127243
H  -1.895255 2.296043 0.090424
H  -2.844748 -1.971925 -0.189728
H  -3.60856 0.441697 -0.079496
H  2.797081 -1.907854 0.877451
H  2.85796 -1.810357 -0.826684
