program: Gaussian 09
title: 000253285
version: EM64L-G09RevD.01
frameworkgroup: C1[X(C9H11N3)]
method: RPBEPBE
basis: SDD
operation: Freq
keyword: #pfreq=noraman
keyword: PBEPBE/SDD
title: #p freq=noraman PBEPBE/SDD
converged: NO NO NO NO
title: Mulliken charges:
elementType: N N N C C C C C C C C C H H H H H H H H H H H
charge: -0.259024 -0.134277 -0.123857 0.243818 0.190980 -0.488987 -0.199822 0.427804 -0.468521 -0.322900 -0.674185 -0.791525 0.257844 0.210574 0.252872 0.262836 0.232443 0.212717 0.226537 0.243442 0.233394 0.233924 0.233915
chargesum: 0.00000
title: Mulliken charges with hydrogens summed into heavy atoms:
elementType: N N N C C C C C C C C C
charge: -0.259024 -0.134277 -0.123857 0.243818 0.190980 -0.020570 0.053050 0.427804 -0.205685 -0.090457 0.008510 -0.090292
polarizability: 1.66676396e+02 -9.13238503e+00 1.20240471e+02 4.46863923e+00 5.16622087e+00 6.44559002e+01
1716.lowfreq: -9.1016 -0.0005 0.0004 0.0006 6.2325 13.0997 76.2363 82.9357 98.4917
frequency: 76.1775 82.9285 98.4692 152.1605 173.9295 214.4054 245.3828 295.9370 325.4183 412.8606 429.7950 451.7629 478.4411 601.9602 612.5681 637.2791 682.5514 741.7571 750.4623 778.0226 784.4717 827.1494 886.6494 921.4197 931.8008 957.2860 978.0319 1010.8996 1039.4300 1047.5310 1064.3807 1078.8634 1158.2175 1160.6968 1224.7117 1262.4449 1289.1355 1303.2507 1314.6217 1369.6644 1390.2990 1400.2306 1448.0803 1456.4921 1462.4886 1466.3349 1470.2001 1476.7177 1488.4718 1496.8832 1524.5266 1644.2412 2977.1144 2981.0382 2987.3165 3053.1888 3065.5731 3086.2147 3095.8150 3098.2584 3154.8616 3175.7033 3188.3129
redmass: 2.3924 3.3896 1.0886 2.8938 1.5675 4.5254 1.6842 3.2922 2.8574 3.9213 3.2109 4.2686 5.0701 4.4189 4.0409 4.6715 5.4810 4.2379 4.5710 1.4526 1.5485 3.8341 1.3401 3.3039 1.3101 2.6569 4.5425 1.5983 2.9790 1.5302 1.7665 2.4309 1.5829 2.4675 1.7696 2.6005 1.6597 2.0454 1.4110 2.8091 1.2194 1.2296 3.5605 1.6435 1.1331 1.0457 2.3349 1.0797 1.2927 2.6597 4.5972 6.5986 1.0378 1.0664 1.0362 1.0975 1.0956 1.0980 1.0984 1.1011 1.0885 1.0930 1.0983
irintensity: 1.0569 0.0608 0.0168 0.2239 0.7238 2.9443 1.2464 0.9223 1.1999 9.5411 5.6365 0.5054 1.3133 4.3248 4.7408 3.1262 1.1139 0.9404 3.2498 16.3850 28.6088 0.3280 11.2908 1.2275 0.0297 16.8503 12.9463 2.6624 14.5073 12.0692 4.7557 5.3097 2.7825 8.5831 3.9611 10.3305 7.0712 6.8602 4.0512 29.0963 9.7472 8.4513 9.1509 10.4498 11.8555 14.8312 6.9602 10.7449 13.3399 9.9291 2.1140 33.4742 34.5226 30.7762 27.4235 18.9798 4.2670 49.8872 16.2879 25.7216 4.0134 3.1081 5.9509
temp: 298.150 k
press: 1.00000 atm
elementType: 7 7 7 6 6 6 6 6 6 6 6 6 1 1 1 1 1 1 1 1 1 1 1
symmnumber: 1
zpe: 487127.1 jmol-1
zpe.correction: 0.185537 hartree
zpe.thermalcorrener: 0.196396 hartree
zpe.thermalcorrenthalpy: 0.197340 hartree
zpe.thermalcorrgfe: 0.148872 hartree
zpe.sumelectzpe: -512.917791 hartree
zpe.sumelectthermal: -512.906932 hartree
zpe.sumelectthermalent: -512.905988 hartree
zpe.sumelectthermalfe: -512.954456 hartree
dipole: 2.2647 -6.1240 -0.4786
dipole: 6.5469
quadrupole: -59.8489 -79.4776 -72.8683
quadrupole: 7.2601 1.3964 0.9032
quadrupole: 10.8827 -8.7460 -2.1367 7.2601 1.3964 0.9032
hfenergy: -513.1033279 hartree
pointgroup: C01 [X(C9H11N3)]
dipole: 0.9796845 2.3821451 0.0005057 debye
dipolederiv: -0.1552748 0.1702037 0.0428943 -0.2673068 -0.5756484 -0.0126362 0.0018541 -0.058413 0.0502246 -0.1466517 -0.2416284 -0.0215534 0.0268067 0.0027596 0.0195362 -0.0083372 0.0419559 -0.2523453 -0.5172461 0.1966049 0.0036732 -0.2732241 -0.2424188 0.0292319 0.0144871 -0.0205504 -0.2375941 0.3716576 -0.1350183 -0.0277948 -0.1329011 0.0605526 -0.0020411 -0.034832 0.0347542 -0.0203817 0.1024775 0.0150216 0.0000102 0.4556243 0.3029689 -0.0062262 0.0350608 0.008331 0.1029284 0.1398047 -0.0012614 0.0202094 0.0402038 0.057319 0.0492018 -0.0712155 0.0615643 0.1351716 0.1833781 0.0730643 -0.0167645 0.1776112 0.1745107 -0.0042649 -0.0129525 0.0098789 -0.0790762 0.400167 0.0082012 -0.0471845 0.1061412 0.0433457 -0.0002672 -0.0376253 0.0041689 -0.0325481 -0.1304726 -0.0517428 -0.0053486 -0.1727054 0.0196974 0.0265075 -0.0153249 0.0142017 -0.1341884 -0.204587 0.0179878 0.0050096 -0.0037399 0.0874892 0.0208185 -0.0010584 0.0172398 -0.1893904 0.0021296 0.0260883 -0.0163129 0.0647186 0.0363952 0.0124506 0.059825 0.0050845 -0.00453 -0.1321215 -0.0294455 0.0189664 -0.1011174 0.0371561 0.0069562 0.0148263 0.0012855 0.0701524 -0.0289535 -0.0342744 0.0468369 -0.0961693 0.0344838 0.0684189 0.0245232 0.0390888 0.0662396 0.0271094 -0.0241684 -0.0854732 0.0705805 -0.0354043 -0.1173817 -0.0259881 -0.0838267 -0.0654071 0.0304404 0.0799609 0.0231536 0.0439844 0.0044354 -0.011929 0.0248741 -0.017853 0.1695554 0.0430889 0.0527243 0.0157085 0.0740232 0.0233872 -0.0175418 0.0179382 -0.0154021 0.1609802 0.0603071 -0.0809082 0.002455 -0.0679419 -0.0456705 -0.0095663 0.004907 -0.0068931 0.1551803 -0.0481987 -0.1307397 0.0717747 -0.1045706 0.0166766 0.0628623 0.0420268 0.0338166 0.0397258 -0.1118768 0.1477452 0.0118902 0.1856898 -0.0174583 0.0036063 0.0065848 -0.008976 0.0707112 0.1014498 -0.0155974 -0.0388626 -0.0695567 0.0010096 -0.1114233 -0.0447385 -0.0625968 -0.0419732 0.0288436 0.0252893 0.0104857 0.1434207 -0.0889422 -0.0292891 0.0189864 -0.0175932 0.1094161 -0.0218545 -0.041799 -0.0395219 -0.0534511 0.0669263 -0.0956497 -0.1080033 -0.0876884 -0.0381833 0.0063835 -0.0263081 0.0257487 -0.0461201 0.0364293 0.1186265 0.0941821 0.1084226 -0.0346677 unknown
polarizability: 167.1319223|7.074342|120.1102362|-6.2625898|1.152609|64.1306086 unknown
InChI: InChI=1S/C9H11N3/c1-3-8-10-11-9-6-7(2)4-5-12(8)9/h4-6H,3H2,1-2H3
charge 0 multiplicity 1
23 atoms
N  -0.370034 0.157966 0.189429
N  -1.789396 -1.58318 0.226844
N  -0.489842 -2.116553 0.047518
C  -1.710653 -0.229493 0.311171
C  0.367201 -1.053621 0.026597
C  -2.86511 0.711342 0.476422
C  0.263731 1.396432 0.218703
C  2.433759 0.247398 -0.093466
C  1.783273 -0.988229 -0.117173
C  1.639241 1.447459 0.081174
C  -3.234509 1.475532 -0.825702
C  3.937389 0.365768 -0.242865
H  -3.725707 0.102379 0.801454
H  -2.65586 1.436079 1.289063
H  -0.364052 2.279493 0.353769
H  2.32968 -1.926669 -0.242643
H  2.130207 2.425314 0.106365
H  -2.398395 2.099833 -1.191054
H  -4.100584 2.137666 -0.648008
H  -3.500258 0.763504 -1.625612
H  4.409526 -0.622877 -0.366085
H  4.389341 0.85132 0.642826
H  4.203355 0.982438 -1.122325
