program: Gaussian 09
title: 000253330
version: EM64L-G09RevD.01
frameworkgroup: C1[X(C22H19NO2)]
method: RPBEPBE
basis: SDD
operation: Freq
keyword: #p
keyword: freq=noraman
keyword: PBEPBE/SDD
title: #p freq=noraman PBEPBE/SDD
converged: YES YES NO NO
title: Mulliken charges:
elementType: O O N C C C C C C C C C C C C C C C C C C C C C C H H H H H H H H H H H H H H H H H H H
charge: -0.284809 -0.283212 -0.427807 -0.164730 -0.512753 -0.171427 0.292600 0.157388 0.454992 -0.403941 -0.385236 -0.387429 -0.430282 0.169503 -0.257900 -0.211548 -0.225695 -0.226763 0.262114 -0.240284 -0.352402 -0.352470 -0.224257 -0.239383 -0.226415 0.287320 0.243856 0.276053 0.226460 0.319166 0.245646 0.254104 0.260629 0.233415 0.229862 0.231033 0.225017 0.225984 0.228342 0.275551 0.212871 0.232992 0.230559 0.233283
chargesum: 0.00000
title: Mulliken charges with hydrogens summed into heavy atoms:
elementType: O O N C C C C C C C C C C C C C C C C C C C C C C
charge: -0.284809 -0.283212 -0.108640 0.122590 0.007155 0.055033 0.292600 0.157388 0.454992 -0.158295 -0.131131 -0.126800 -0.196868 0.169503 -0.028038 0.019485 -0.000679 -0.000779 0.262114 -0.011941 -0.076850 -0.139599 0.008736 -0.008824 0.006869
polarizability: 2.92179760e+02 9.96977972e+00 2.86350137e+02 1.02363318e+01 -1.41741270e+01 1.61469754e+02
1716.lowfreq: -0.0007 0.0003 0.0008 0.9515 5.8534 8.9517 21.0268 23.9886 26.8699
frequency: 20.9062 23.8406 26.7930 43.9134 46.5336 54.9664 78.8190 118.7598 128.9053 165.8503 182.1870 215.9450 219.1173 256.4537 283.4166 286.0907 315.8209 378.8061 397.7618 401.7137 403.1290 420.2051 462.7725 489.2099 515.6353 524.5257 528.9337 548.4318 564.4244 569.8137 613.3506 615.4389 617.2912 660.2798 674.9911 694.3666 703.7429 706.5486 724.0518 746.3961 762.1229 765.8691 793.3185 818.6290 847.0742 853.9383 856.5448 865.9820 890.2136 891.9257 914.6997 929.6727 936.4845 952.1259 980.1926 982.2395 984.5526 989.6531 990.2295 996.3092 1000.1571 1006.3248 1024.7091 1026.8574 1030.3680 1062.8234 1082.7409 1084.4311 1087.2831 1110.5714 1131.3377 1166.0343 1172.5895 1173.1583 1183.2866 1186.1101 1188.2310 1192.0676 1207.7749 1219.8400 1240.5991 1253.0806 1278.7369 1308.8119 1316.6425 1320.1341 1331.1950 1343.8482 1360.5814 1385.1970 1386.5272 1388.3430 1431.1194 1439.6729 1444.2757 1453.5053 1456.3022 1475.7892 1485.4966 1488.0963 1564.6737 1584.7649 1595.9870 1601.9770 1611.3809 1616.9104 1617.9745 2958.2457 3009.3696 3020.9022 3090.7799 3114.8653 3117.7531 3120.7760 3127.3278 3132.1522 3137.1026 3141.2776 3145.0799 3156.8836 3157.6725 3157.8426 3168.5082 3169.4420 3171.3938 3558.0957
redmass: 5.0909 4.1951 3.9099 5.1345 6.1433 6.0342 4.7376 4.6977 4.3683 4.9859 5.6953 4.8544 5.2374 5.0341 5.0811 4.9187 5.0705 4.4650 3.0022 2.7807 2.8401 4.2571 3.9095 3.3513 3.6270 2.4314 1.7247 5.1496 3.6819 3.7851 5.9100 6.2254 6.0950 6.5754 4.8197 3.5156 1.6795 1.8532 4.1018 4.7548 1.8706 1.2916 2.4264 5.4201 3.8208 1.2661 1.2637 1.4196 3.1508 3.6269 2.5629 1.6228 1.5519 1.3928 1.3882 1.3093 1.4021 5.6971 6.1069 1.5270 2.2722 1.3443 2.4229 2.1882 2.1771 2.9794 1.7001 2.3478 1.7767 1.8164 2.4716 1.1124 1.0543 1.0613 1.4237 1.2191 1.6137 1.1343 2.2148 1.7915 1.9601 1.8300 1.4734 1.4905 1.3288 1.4379 1.5694 1.3796 1.4816 8.9338 8.5608 6.3466 2.2128 2.2294 2.3671 2.0512 1.0991 2.6047 2.3792 2.3458 6.9997 7.0871 6.2082 6.6303 6.0659 6.2091 6.7526 1.0837 1.0753 1.0729 1.0999 1.0876 1.0873 1.0882 1.0867 1.0869 1.0884 1.0924 1.0919 1.0963 1.0941 1.0956 1.0993 1.1009 1.0996 1.0779
irintensity: 0.0693 0.5794 0.2747 0.8685 3.3929 3.5757 0.6814 1.4847 0.9969 0.3572 1.8211 11.6027 0.8589 2.6226 3.0031 3.0340 3.4925 0.1746 0.6699 0.6821 0.4427 2.4254 6.1815 14.8245 11.6697 33.9212 33.3663 6.8608 12.0047 5.7182 1.1159 0.3133 0.4318 7.5563 15.8643 6.2516 50.6371 81.1521 7.1856 1.9190 54.1980 85.4886 19.3136 2.9596 3.6951 1.1598 0.3928 1.7397 31.4228 11.3547 4.4670 3.0909 2.1337 3.0432 0.0834 0.1262 1.6666 0.9509 0.6361 20.0139 53.2543 1.3985 9.1328 13.8970 10.6686 13.7891 13.5726 19.7284 15.1998 39.5747 7.9878 4.6385 0.4261 1.3758 25.6237 9.8518 8.4545 8.7873 151.0089 3.7168 51.1413 91.0105 16.9281 24.2634 3.0773 0.7375 18.7422 8.2411 6.9274 2.0929 2.1973 18.8422 48.3101 23.1376 71.6465 360.9664 10.4391 68.5199 19.4805 107.8823 113.8713 32.0725 1.1404 39.1538 5.0556 2.9575 36.8104 26.3974 6.5761 20.3607 10.1628 9.3044 13.4018 5.3655 0.7766 1.7885 10.2300 27.6023 21.0693 36.1492 15.7299 16.6138 14.1305 23.5139 17.2350 15.3522
temp: 298.150 k
press: 1.00000 atm
elementType: 8 8 7 6 6 6 6 6 6 6 6 6 6 6 6 6 6 6 6 6 6 6 6 6 6 1 1 1 1 1 1 1 1 1 1 1 1 1 1 1 1 1 1 1
symmnumber: 1
zpe: 922354.9 jmol-1
zpe.correction: 0.351306 hartree
zpe.thermalcorrener: 0.371758 hartree
zpe.thermalcorrenthalpy: 0.372703 hartree
zpe.thermalcorrgfe: 0.299062 hartree
zpe.sumelectzpe: -1053.221241 hartree
zpe.sumelectthermal: -1053.200789 hartree
zpe.sumelectthermalent: -1053.199845 hartree
zpe.sumelectthermalfe: -1053.273485 hartree
dipole: -1.2138 0.7558 -2.5768
dipole: 2.9469
quadrupole: -130.2398 -130.3718 -153.1602
quadrupole: -0.6303 11.5542 1.4049
quadrupole: 7.6842 7.5521 -15.2362 -0.6303 11.5542 1.4049
hfenergy: -1053.5725473 hartree
pointgroup: C01 [X(C22H19N1O2)]
dipole: -0.4596885 0.2648469 -1.0309099 debye
polarizability: 291.670616|10.6295189|285.4878249|12.4130995|-17.629732|162.8412107 unknown
InChI: InChI=1S/C22H19NO2/c24-22(17-11-5-2-6-12-17)23-19-15-21(16-9-3-1-4-10-16)25-20-14-8-7-13-18(19)20/h1-14,19,21,23H,15H2
charge 0 multiplicity 1
44 atoms
O  2.387626 0.971441 -0.587159
O  -1.996798 -0.866382 2.124641
N  -1.27907 0.440824 0.35111
C  -0.07826 0.926638 1.078406
C  1.028272 -0.153881 1.157988
C  1.733348 -0.313092 -0.202035
C  0.451307 2.184553 0.402773
C  1.645402 2.143876 -0.368491
C  2.805714 -1.387005 -0.195358
C  -0.212793 3.428007 0.549935
C  2.165782 3.320871 -0.960613
C  4.140052 -1.088828 0.174014
C  2.45515 -2.723899 -0.506234
C  -2.197217 -0.40363 0.953998
C  0.288506 4.60374 -0.044458
C  1.488003 4.543965 -0.79849
C  5.107687 -2.11634 0.235249
C  3.420805 -3.752604 -0.438146
C  -3.43179 -0.747996 0.158636
C  4.751516 -3.451485 -0.065985
C  -4.177326 -1.882097 0.570848
C  -3.889386 0.016587 -0.947191
C  -5.345532 -2.260328 -0.122454
C  -5.061636 -0.359776 -1.638453
C  -5.789236 -1.50244 -1.232229
H  -0.408874 1.150685 2.110098
H  1.776407 0.135709 1.92023
H  0.584135 -1.11281 1.47183
H  0.972614 -0.542881 -0.978623
H  -1.423276 0.772361 -0.603292
H  -1.130098 3.464397 1.151011
H  3.089703 3.249515 -1.542735
H  4.414504 -0.051425 0.388607
H  1.425538 -2.962794 -0.801966
H  -0.238006 5.555064 0.083115
H  1.893075 5.451141 -1.260294
H  6.139368 -1.875802 0.516061
H  3.138016 -4.783231 -0.680028
H  5.503025 -4.247459 -0.016873
H  -3.821375 -2.441366 1.442298
H  -3.365938 0.928697 -1.259767
H  -5.911349 -3.140561 0.201669
H  -5.411929 0.240997 -2.484872
H  -6.698364 -1.793754 -1.769878
