program: Gaussian 09
title: 000253283
version: EM64L-G09RevD.01
frameworkgroup: C1[X(C13H11N3)]
method: RPBEPBE
basis: SDD
operation: Freq
keyword: #pfreq=noraman
keyword: PBEPBE/SDD
title: #p freq=noraman PBEPBE/SDD
converged: NO NO NO NO
title: Mulliken charges:
elementType: N N N C C C C C C C C C C C C C H H H H H H H H H H H
charge: -0.242802 -0.105815 -0.119603 0.070478 0.191594 -0.376995 0.411042 0.298062 -0.303297 -0.278724 -0.372516 -0.372459 -0.806085 -0.219589 -0.219620 -0.230377 0.275175 0.258575 0.243267 0.249821 0.249820 0.227598 0.237161 0.237181 0.232436 0.232433 0.233238
chargesum: 0.00000
title: Mulliken charges with hydrogens summed into heavy atoms:
elementType: N N N C C C C C C C C C C C C C
charge: -0.242802 -0.105815 -0.119603 0.070478 0.191594 -0.101820 0.411042 0.298062 -0.044722 -0.035457 -0.122695 -0.122640 -0.104145 0.012848 0.012813 0.002862
polarizability: 2.14764469e+02 -4.86138572e+00 1.48982782e+02 -5.54497390e-03 -2.05854085e-02 1.08656567e+02
1716.lowfreq: -51.1712 -3.4572 -0.0005 0.0002 0.0006 10.5212 16.7901 63.1327 71.1052
frequency: -51.1504 63.1326 71.0778 117.8590 139.7775 199.0754 208.7320 288.0167 301.2048 331.1713 400.2902 424.2930 431.3901 435.2293 470.2384 570.2620 595.1957 604.1690 611.6827 681.7314 689.8479 703.2388 748.8833 756.8681 776.2213 811.8471 815.5145 851.3630 859.2540 929.3180 932.9626 959.3735 971.1139 981.5218 988.1151 994.4765 1001.2006 1016.1382 1028.5133 1050.7859 1078.1234 1114.7289 1133.8289 1174.1380 1188.1048 1199.2245 1247.8442 1259.5729 1305.8532 1311.9638 1359.1927 1369.9316 1385.4105 1404.2188 1429.6622 1430.6541 1466.1265 1473.7577 1510.8009 1517.8191 1526.5700 1583.3875 1617.0592 1641.6352 2979.6446 3058.6520 3090.5700 3126.0840 3132.5493 3142.4402 3145.1618 3153.2725 3166.6282 3174.9836 3189.3004
redmass: 4.0173 4.8187 3.8820 1.4206 2.1884 4.5458 4.1277 4.1643 4.1777 4.3850 2.8227 5.4561 3.1802 4.7447 4.9296 4.1290 3.3723 6.2539 6.5766 6.4491 8.8336 1.7634 4.1250 5.3213 2.2570 5.0370 1.4762 1.3484 1.2761 1.5239 3.8572 4.5772 1.2986 1.3903 6.2381 5.1377 1.3430 1.8520 2.1133 1.5074 1.6036 3.2412 1.4248 1.0544 1.1180 6.3151 3.6791 2.3641 1.6709 1.3698 2.9972 6.8396 4.5728 1.2511 2.2034 2.8782 1.0448 1.1521 4.0331 4.8297 4.8008 5.9482 6.3286 6.3858 1.0371 1.0980 1.0990 1.0849 1.0882 1.0928 1.0903 1.0971 1.1018 1.0940 1.0961
irintensity: 0.5856 1.5934 0.0834 0.0240 1.5647 0.1866 0.2654 0.3049 6.0419 1.2278 0.0193 0.0090 8.1722 0.5874 6.2867 10.2662 7.8152 0.7231 0.0115 8.2196 0.0361 53.5941 14.5338 0.0000 33.9249 6.7474 53.0803 0.4597 0.5948 1.8987 4.2160 13.5450 0.4526 0.0479 4.4736 9.1259 0.0162 3.9110 11.4535 9.9914 9.0996 4.3382 4.0784 0.0008 2.4306 4.9149 7.5783 9.9759 11.3591 0.2529 29.6806 0.3303 8.8895 16.9515 8.9565 46.0978 12.8468 7.9138 4.1758 9.2285 3.8898 1.4529 1.0186 2.8674 32.0293 16.9238 16.6214 0.6670 0.2376 16.8442 8.1149 29.6175 19.9731 2.0935 4.1130
temp: 298.150 k
press: 1.00000 atm
elementType: 7 7 7 6 6 6 6 6 6 6 6 6 6 6 6 6 1 1 1 1 1 1 1 1 1 1 1
symmnumber: 1
zpe: 549684.0 jmol-1
zpe.correction: 0.209364 hartree
zpe.thermalcorrener: 0.221135 hartree
zpe.thermalcorrenthalpy: 0.222079 hartree
zpe.thermalcorrgfe: 0.171059 hartree
zpe.sumelectzpe: -665.111123 hartree
zpe.sumelectthermal: -665.099352 hartree
zpe.sumelectthermalent: -665.098407 hartree
zpe.sumelectthermalfe: -665.149428 hartree
dipole: 0.6651 6.8837 0.0015
dipole: 6.9158
quadrupole: -73.5546 -107.5441 -88.4864
quadrupole: 0.8273 -0.0028 -0.0084
quadrupole: 16.3071 -17.6824 1.3753 0.8273 -0.0028 -0.0084
hfenergy: -665.3204866 hartree
pointgroup: C01 [X(C13H11N3)]
dipole: -0.2211278 -2.7118702 0.0005979 debye
polarizability: 214.895125|-3.8757194|148.8521258|0.0052366|0.020666|108.6565669 unknown
InChI: InChI=1S/C13H11N3/c1-10-7-8-12-14-15-13(16(12)9-10)11-5-3-2-4-6-11/h2-9H,1H3
charge 0 multiplicity 1
27 atoms
N  -0.927479 0.259298 -0.000373
N  0.022045 2.300014 -0.001493
N  -1.373595 2.496879 0.000371
C  0.284075 0.961095 -0.000257
C  -1.945527 1.254435 -0.000188
C  -1.218085 -1.103494 -0.00045
C  -2.541773 -1.52224 -0.000337
C  1.615259 0.308546 -0.000069
C  -3.306424 0.837082 -0.000019
C  -3.593639 -0.525701 -0.000119
C  2.262929 -0.002964 1.224285
C  2.262481 -0.004419 -1.224279
C  -2.888123 -2.998395 -0.000235
C  3.535144 -0.61708 1.224166
C  3.534684 -0.618561 -1.223881
C  4.172885 -0.927383 0.000211
H  -0.365687 -1.786802 -0.000533
H  -4.086243 1.602006 0.00031
H  -4.636506 -0.861235 0.00013
H  1.774343 0.254094 2.171019
H  1.773552 0.251505 -2.171143
H  -1.982861 -3.62907 -0.000908
H  -3.489067 -3.264044 -0.890029
H  -3.487851 -3.264231 0.89033
H  4.029577 -0.844876 2.174892
H  4.028763 -0.847504 -2.174515
H  5.162326 -1.398558 0.000312
