program: Gaussian 09
title: 000253281
version: EM64L-G09RevD.01
frameworkgroup: C1[X(C10H13N3)]
method: RPBEPBE
basis: SDD
operation: Freq
keyword: #pfreq=noraman
keyword: PBEPBE/SDD
title: #p freq=noraman PBEPBE/SDD
converged: NO YES NO YES
title: Mulliken charges:
elementType: N N N C C C C C C C C C C H H H H H H H H H H H H H
charge: -0.316320 -0.149454 -0.128895 0.345849 0.201690 0.179239 -0.402595 0.453049 -0.483832 -0.473022 -0.750991 -0.680523 -0.798345 0.213153 0.213140 0.232656 0.261409 0.236269 0.236271 0.238445 0.235945 0.202513 0.235971 0.232766 0.232768 0.232845
chargesum: 0.00000
title: Mulliken charges with hydrogens summed into heavy atoms:
elementType: N N N C C C C C C C C C C
charge: -0.316320 -0.149454 -0.128895 0.345849 0.201690 0.179239 0.023699 0.453049 -0.251176 -0.211613 -0.040005 -0.006094 -0.099967
polarizability: 1.84669953e+02 4.14238738e+00 1.34358406e+02 2.57351126e-03 9.15889457e-03 7.00374129e+01
1716.lowfreq: -11.2760 -8.6991 -0.0005 -0.0005 0.0003 5.2258 32.2423 54.1869 104.3774
frequency: 32.1152 54.1567 104.3747 152.7621 165.7413 177.1453 201.6027 220.2560 273.4574 276.6286 284.3556 331.9688 362.0082 479.2604 517.5537 519.4331 560.4402 599.6814 604.3405 644.8177 680.3555 738.1686 804.0336 818.4398 854.0910 885.8089 939.6472 965.0492 980.5742 1008.4547 1015.2550 1039.3699 1044.6161 1047.2537 1076.2840 1089.2656 1092.8884 1164.0017 1204.7340 1254.0228 1255.4304 1289.9926 1333.3480 1347.8084 1396.2717 1397.5474 1405.6131 1407.5878 1445.5369 1459.6373 1464.6536 1465.5808 1466.5192 1467.2317 1482.8189 1485.9306 1499.8770 1551.9448 1650.1137 2970.0156 2976.4577 2994.0990 3000.7937 3016.4599 3052.4139 3074.3948 3094.7677 3098.3501 3107.1975 3112.9078 3150.4601 3176.6237
redmass: 1.8234 3.0679 1.0703 2.7727 3.2609 1.4186 1.4500 2.0371 2.4524 2.6175 3.4831 3.4715 4.4327 4.5291 3.4527 5.2470 5.0937 4.3886 3.2771 6.6010 3.7065 4.7087 1.2773 5.9200 1.2968 1.3679 2.6286 4.5603 1.8460 8.4113 1.5631 2.0199 1.4997 1.5361 3.0102 1.4866 3.3748 2.0546 5.4274 1.4892 1.1578 2.3473 4.7134 2.0317 1.2814 1.2488 1.2584 2.6996 3.0341 1.3797 1.0429 1.2944 1.0445 1.0435 1.2096 1.1551 2.6400 5.7751 6.6929 1.0577 1.0377 1.0389 1.0366 1.1005 1.0974 1.0980 1.0984 1.0999 1.0981 1.1004 1.0918 1.0933
irintensity: 0.0800 1.1550 0.0182 0.6747 1.9954 2.4826 0.1891 4.0694 0.0948 1.8701 1.8764 0.5225 0.3645 1.5947 0.7145 0.6473 1.3129 1.9246 5.8734 0.2713 0.9134 1.6316 8.2747 0.1907 32.9085 2.4332 0.0678 10.0161 4.6006 8.4916 2.1911 4.9443 1.2956 17.3195 2.2669 0.7560 10.9513 6.3030 7.8106 4.3001 0.1357 28.5560 3.8598 10.2473 23.8611 5.6731 14.1180 13.9362 1.4824 8.7321 0.0691 25.9322 39.6952 7.0593 4.0794 14.7785 15.4774 19.5075 51.0899 15.7384 37.2855 27.6576 40.1674 12.4337 19.4203 15.6849 17.5508 33.4475 14.5875 27.7453 10.8185 2.3180
temp: 298.150 k
press: 1.00000 atm
elementType: 7 7 7 6 6 6 6 6 6 6 6 6 6 1 1 1 1 1 1 1 1 1 1 1 1 1
symmnumber: 1
zpe: 558433.5 jmol-1
zpe.correction: 0.212696 hartree
zpe.thermalcorrener: 0.225309 hartree
zpe.thermalcorrenthalpy: 0.226253 hartree
zpe.thermalcorrgfe: 0.173415 hartree
zpe.sumelectzpe: -552.145404 hartree
zpe.sumelectthermal: -552.132791 hartree
zpe.sumelectthermalent: -552.131847 hartree
zpe.sumelectthermalfe: -552.184685 hartree
dipole: 2.5684 6.2219 0.0008
dipole: 6.7312
quadrupole: -68.2611 -83.2735 -79.1504
quadrupole: -8.0466 -0.0012 -0.0005
quadrupole: 8.6339 -6.3785 -2.2554 -8.0466 -0.0012 -0.0005
hfenergy: -552.3581002 hartree
pointgroup: C01 [X(C10H13N3)]
dipole: -1.0626922 2.425676 -0.0003198 debye
dipolederiv: -0.2356896 -0.1678152 0.0000155 0.2112176 -0.645032 0.0000897 -0.000027 0.0000846 0.0311034 -0.1436935 0.2394696 -0.0000424 -0.0384857 -0.0344561 -0.0000227 0.0000233 -0.0000217 -0.2405763 -0.5488802 -0.1622901 0.000019 0.2767161 -0.2528213 0.0000029 -0.0000419 0.0000011 -0.2432286 0.3355284 0.111562 0.0000048 -0.1004657 0.4159639 -0.0000494 0.0000676 0.0000235 0.0240478 0.3767715 0.1244776 -0.0000085 0.1597344 0.0995401 -0.0000179 -0.0001303 -0.0000599 -0.0018428 0.1893804 -0.0519004 -0.0000022 -0.4376618 0.2981825 -0.000028 0.0000696 -0.0000275 0.1091898 0.0687422 0.0342038 -0.0000295 0.009935 0.0322685 0.0000245 0.0000443 0.0000746 0.1945251 0.4258375 0.0518266 -0.0000045 -0.0832898 0.1396937 -0.0000257 -0.0000063 -0.0000259 -0.0230456 -0.2753621 -0.1873594 0.0000163 -0.0194816 -0.0522838 -0.0000232 -0.0000097 -0.0000295 -0.2197345 -0.2141182 0.0559345 -0.0000084 0.1415511 -0.0155934 -0.0000236 -0.0000203 -0.0000193 -0.154093 -0.0384913 -0.1138552 0.0000287 -0.0147416 -0.100981 0.0000238 -0.0000389 -0.0000466 0.0717905 0.0301682 0.0577484 -0.0000226 0.0054006 0.0616719 -0.0000026 -0.000016 -0.0000132 0.0598567 -0.1408367 0.0016836 0.000001 0.0758603 0.0470343 0.0000036 0.0000159 0.0000011 0.0716854 -0.0182907 0.003298 -0.0539155 -0.0398747 -0.0291854 0.0995584 -0.0210232 0.1281972 -0.0447476 -0.0182671 0.0033916 0.0539336 -0.0397926 -0.0293336 -0.0995577 0.0210638 -0.1281986 -0.0445628 0.0488939 0.0797919 -0.0000089 0.0844342 -0.0530406 0.0000336 -0.0000113 0.0000344 0.1523473 0.0551418 -0.0470761 0.0000048 -0.0710223 0.007104 0.0000233 0.0000087 0.0000207 0.1643898 0.0278816 -0.0716405 0.1035547 -0.0418644 0.0494797 -0.0232616 0.1142241 0.0283284 -0.0258527 0.02796 -0.0716764 -0.103508 -0.0419235 0.0494356 0.0232014 -0.1141818 -0.0283873 -0.0259458 -0.0315134 0.1670345 -0.0000754 0.0550518 -0.0115624 0.0000477 -0.0000316 0.000063 0.1187829 0.099839 0.0040466 0.0066574 0.0664975 0.0286113 0.1004803 -0.0248909 0.0940303 -0.0539271 -0.1296968 -0.1062376 0.0000083 -0.1840833 -0.0395326 0.0000303 0.0000302 0.0000394 0.1013446 0.0998703 0.0040752 -0.006613 0.0665577 0.0284782 -0.1005112 0.0248863 -0.0940762 -0.0537389 -0.0166404 0.0285032 -0.0438034 0.0474409 0.0578704 0.1042961 -0.1140913 0.0879558 -0.0397201 -0.0166523 0.0285147 0.0437983 0.0474627 0.05784 -0.104309 0.1140778 -0.0879715 -0.0396857 0.0421175 -0.0157109 -0.0000003 -0.135173 -0.1093518 0.0000168 0.0000088 0.0000231 0.1116384 unknown
polarizability: 184.8242511|-3.061471|134.2041079|0.002769|-0.0091017|70.0374129 unknown
InChI: InChI=1S/C10H13N3/c1-4-9-11-12-10-6-7(2)5-8(3)13(9)10/h5-6H,4H2,1-3H3
charge 0 multiplicity 1
26 atoms
N  0.240113 0.161411 0.000178
N  1.8060 -1.461873 0.000411
N  0.552675 -2.10778 0.000505
C  -0.529573 1.341093 -0.000007
C  1.62636 -0.11711 0.000246
C  -0.390935 -1.125656 0.000368
C  2.764559 0.872316 0.000075
C  -2.587412 -0.073261 0.000186
C  -1.911706 1.205649 -0.000005
C  -1.811011 -1.228418 0.000373
C  0.150038 2.690306 -0.000142
C  4.138853 0.167928 0.00058
C  -4.101722 -0.117679 0.000185
H  2.696121 1.532181 -0.88731
H  2.695806 1.53287 0.886916
H  -2.509135 2.123111 -0.000145
H  -2.247973 -2.230099 0.000519
H  0.786005 2.834386 -0.891641
H  0.785501 2.834798 0.891657
H  -0.615238 3.482307 -0.000533
H  4.250577 -0.477342 0.887225
H  4.946489 0.922004 0.000419
H  4.250868 -0.478039 -0.885519
H  -4.516212 0.393179 -0.889566
H  -4.516214 0.393324 0.889853
H  -4.474434 -1.155305 0.000271
