program: Gaussian 09
title: 000253267
version: EM64L-G09RevD.01
frameworkgroup: C1[X(C4H6N4O3)]
method: RPBEPBE
basis: SDD
operation: Freq
keyword: #pfreq=noraman
keyword: PBEPBE/SDD
title: #p freq=noraman PBEPBE/SDD
converged: NO YES NO YES
title: Mulliken charges:
elementType: O O O N N N N C C C C H H H H H H
charge: -0.168415 -0.206809 -0.206807 -0.208577 -0.208602 0.140880 0.140891 -0.408091 -0.387885 -0.387873 0.347743 0.238872 0.249675 0.277910 0.254585 0.254586 0.277916
chargesum: 0.00000
title: Mulliken charges with hydrogens summed into heavy atoms:
elementType: O O O N N N N C C C C
charge: -0.168415 -0.206809 -0.206807 -0.208577 -0.208602 0.140880 0.140891 0.080456 0.144610 0.144630 0.347743
polarizability: 1.30882044e+02 4.01579668e-04 8.36685457e+01 -4.91952780e-04 -3.07045277e+00 4.64881576e+01
1716.lowfreq: -12.1135 -5.8131 -5.6381 0.0006 0.0009 0.0009 13.5155 41.1717 159.9096
frequency: 11.5718 41.0909 159.9089 202.5491 210.9245 262.7347 280.7505 323.8040 345.6490 363.7400 372.3460 471.9526 473.7694 620.6117 694.1488 718.3152 734.5322 736.0398 845.5289 877.6352 937.3660 974.8839 1013.0226 1088.8556 1110.9670 1171.2039 1198.2047 1207.2273 1263.5378 1272.4621 1331.2131 1346.7526 1359.5463 1398.4892 1408.8199 1463.8161 1479.8121 1486.8537 1655.2153 2992.1278 2992.2941 3018.8602 3060.1686 3062.5221 3087.6113
redmass: 2.7342 12.3836 6.8578 9.8789 11.6278 2.9631 7.8606 5.5894 11.1055 2.7920 7.5315 7.6494 3.6235 3.2269 10.9902 8.7132 6.8619 6.0390 2.8866 1.3504 2.2016 6.0279 3.8320 1.6342 2.0505 3.0548 1.1794 9.5387 1.1889 1.8494 1.5881 1.6069 1.5718 7.4131 5.6045 1.0866 1.0999 1.0779 12.7926 1.0645 1.0634 1.0621 1.0979 1.0972 1.1042
irintensity: 0.1167 1.7027 1.0573 6.7424 0.0077 0.0439 0.4020 6.0893 1.5531 3.5209 9.7241 32.4043 0.8747 2.2899 13.2974 108.0976 367.6078 0.4677 1.6540 0.2992 4.4292 751.9949 9.0642 78.0120 1.2773 50.8501 9.2196 24.1954 14.8310 121.0183 100.2979 1.0869 17.1268 2.3192 95.5678 14.4315 28.0218 7.5994 262.8999 25.1032 3.9661 13.9779 0.2622 15.3317 21.3027
temp: 298.150 k
press: 1.00000 atm
elementType: 8 8 8 7 7 7 7 6 6 6 6 1 1 1 1 1 1
symmnumber: 1
zpe: 305821.9 jmol-1
zpe.correction: 0.116481 hartree
zpe.thermalcorrener: 0.126661 hartree
zpe.thermalcorrenthalpy: 0.127605 hartree
zpe.thermalcorrgfe: 0.078767 hartree
zpe.sumelectzpe: -599.729666 hartree
zpe.sumelectthermal: -599.719487 hartree
zpe.sumelectthermalent: -599.718542 hartree
zpe.sumelectthermalfe: -599.767381 hartree
dipole: 0.0002 6.7187 -0.2682
dipole: 6.7240
quadrupole: -82.2095 -65.7212 -59.0808
quadrupole: 0.0003 0.0004 1.0025
quadrupole: -13.2057 3.2826 9.9231 0.0003 0.0004 1.0025
hfenergy: -599.8461479 hartree
pointgroup: C01 [X(C4H6N4O3)]
dipole: -0.0091298 2.6407942 -0.1563447 debye
dipolederiv: -0.5509818 0.0014961 -0.0008065 0.0014871 -1.0203828 0.1009266 -0.0008278 0.102578 -0.3077284 -1.2289057 -0.1724106 -0.0167806 0.6538413 -0.152315 0.0315842 -0.1473784 -0.0105057 -0.1524408 -1.2259732 0.1647536 0.0127481 -0.6616508 -0.1558246 0.0293286 0.1435405 -0.0088618 -0.1518615 -1.8281493 0.168922 -0.0879973 -0.299736 -0.4804397 0.0308915 -0.0535166 -0.0065058 -0.1584773 -1.8294404 -0.1785604 0.0817565 0.2899248 -0.479643 0.0325026 0.0477082 -0.0068267 -0.1579912 2.0294462 0.3187037 0.0464415 0.2240214 0.0932417 -0.0286978 0.08189 -0.0058493 -0.0216188 2.0336032 -0.3047687 -0.0389663 -0.21003 0.0894752 -0.0297136 -0.0746229 -0.0074936 -0.0220622 0.1299718 0.0002606 0.0000165 0.0002896 0.0425818 0.0040117 -0.0000681 0.028415 0.1099072 -0.0228343 -0.0125012 -0.004608 -0.0799792 0.2865783 -0.042756 0.0718451 -0.0244733 0.287142 -0.0231833 0.0103559 0.0038037 0.0779428 0.2872285 -0.0424489 -0.0728159 -0.0249585 0.2869063 2.3217407 0.00352 0.0042315 0.0036519 1.4085293 -0.1780634 0.004095 -0.1289005 0.3544641 0.0460775 0.0005613 -0.0001834 0.000599 -0.1314536 0.0231026 -0.0002521 0.0399594 0.1026095 0.0337545 -0.0002416 0.000082 -0.0003546 0.104571 0.0526811 0.0002998 -0.0081723 -0.112462 -0.0198894 0.0819646 0.0562295 -0.0163686 0.0619879 0.0044022 0.0358738 -0.0206946 0.0748808 0.0772252 -0.0264346 0.0007851 -0.0346582 -0.0080414 0.0040346 -0.0415784 0.0515669 -0.1029758 0.0766184 0.0268361 -0.000134 0.0352479 -0.0076016 0.0041577 0.041877 0.0519683 -0.1028174 -0.0190802 -0.0824569 -0.0566183 0.0157716 0.0615081 0.0040563 -0.0360692 -0.0212456 0.0745255 unknown
polarizability: 130.8811096|0.177364|83.5372957|0.1646785|-3.7829249|46.6203418 unknown
InChI: InChI=1S/C4H6N4O3/c9-4-7(5-10)2-1-3-8(4)6-11/h1-3H2
charge 0 multiplicity 1
17 atoms
O  0.006053 -2.083378 0.25092
O  -3.450219 -0.135025 -0.144141
O  3.449641 -0.110295 -0.131751
N  -1.199136 -0.071085 -0.042274
N  1.19783 -0.062446 -0.037863
N  -2.414411 -0.852101 -0.00544
N  2.418512 -0.834799 0.003148
C  -0.00901 2.042425 0.412526
C  -1.261102 1.402997 -0.201092
C  1.2499 1.412038 -0.196421
C  0.001957 -0.853629 0.077424
H  -0.012528 3.126246 0.203317
H  -0.01058 1.911794 1.509652
H  -2.191807 1.742618 0.286564
H  -1.352382 1.649875 -1.277059
H  1.34345 1.659617 -1.272037
H  2.176333 1.758248 0.294725
