program: Gaussian 09
title: 000253249
version: EM64L-G09RevD.01
frameworkgroup: C1[X(C11H10O3)]
method: RPBEPBE
basis: SDD
operation: Freq
keyword: #pfreq=noraman
keyword: PBEPBE/SDD
title: #p freq=noraman PBEPBE/SDD
converged: YES YES NO NO
title: Mulliken charges:
elementType: O O O C C C C C C C C C C C H H H H H H H H H H
charge: -0.219379 -0.417471 -0.218300 -0.323508 -0.475407 0.372932 -0.531236 0.119690 0.057538 -0.381360 0.171865 -0.353732 -0.226549 -0.237053 0.278732 0.228625 0.227535 0.247635 0.285901 0.260629 0.283073 0.233190 0.237330 0.379322
chargesum: 0.00000
title: Mulliken charges with hydrogens summed into heavy atoms:
elementType: O O O C C C C C C C C C C C
charge: -0.219379 -0.038149 -0.218300 -0.044776 -0.019247 0.372932 0.002301 0.119690 0.057538 -0.120731 0.171865 -0.070660 0.006640 0.000276
polarizability: 1.38619442e+02 -5.83484872e+00 1.47957864e+02 -8.10729907e+00 -6.66711062e+00 7.54154985e+01
1716.lowfreq: -13.6771 0.0006 0.0008 0.0009 6.7639 12.2101 33.0785 50.7743 91.5378
frequency: 33.0494 50.7332 91.5344 129.6635 188.3687 224.4729 283.6465 291.6855 330.4876 398.2949 429.8300 445.6271 490.8902 504.5632 541.5151 564.3912 607.1329 622.9781 668.8099 687.1138 721.6597 761.7465 777.3475 813.9500 836.3496 888.4848 902.6000 929.7219 980.3031 1007.9849 1027.3878 1034.7110 1040.4855 1044.5455 1102.3319 1122.4336 1161.6671 1173.2812 1193.0319 1201.5209 1237.1474 1247.5111 1289.1298 1305.5602 1309.2396 1341.3006 1363.3625 1387.3233 1436.7680 1441.4448 1467.2730 1473.6879 1572.6881 1590.2487 1616.6698 1660.3688 2997.1588 3001.3544 3028.2302 3061.5135 3074.6106 3130.2348 3142.1778 3153.4471 3167.2711 3508.1852
redmass: 10.8563 6.2599 5.0670 5.1314 3.4734 3.6286 4.0425 4.2122 6.1020 3.0525 4.3043 4.9282 3.6507 4.4971 4.0884 3.1473 2.1389 1.9914 4.6879 3.6049 3.5131 2.8224 1.6599 2.8477 3.2504 2.2193 1.6710 2.7134 1.3956 1.3499 3.1250 2.7198 2.0724 2.5590 1.8282 1.9407 1.2701 1.1098 1.4215 2.0564 1.6054 1.7414 1.9218 1.5351 1.6494 1.6521 1.4614 7.9198 1.7456 1.3019 1.1740 2.0972 7.7660 7.4161 7.5515 8.2370 1.0644 1.0614 1.0829 1.1009 1.0983 1.0859 1.0897 1.0946 1.1006 1.0640
irintensity: 0.6127 2.4377 1.1537 1.0171 4.8155 1.0944 3.2471 2.5739 1.6519 1.7312 1.5662 14.2498 11.2118 7.3982 13.2756 27.2783 57.7549 57.6822 8.3360 32.1570 21.3786 19.8815 44.3780 11.1429 5.7455 13.1095 1.8002 28.1267 3.7484 0.5319 5.8715 159.1130 3.0725 111.1578 18.1991 20.2568 6.5341 4.6387 5.2269 5.4228 7.6728 31.3124 82.6546 8.0595 34.7399 25.6451 6.7903 2.7268 45.2013 6.3622 10.4018 16.3431 60.4489 100.2378 46.7573 191.7604 8.1502 28.1660 13.8402 26.4697 13.2107 1.2287 7.7172 7.0697 27.0856 25.4750
temp: 298.150 k
press: 1.00000 atm
elementType: 8 8 8 6 6 6 6 6 6 6 6 6 6 6 1 1 1 1 1 1 1 1 1 1
symmnumber: 1
zpe: 486343.2 jmol-1
zpe.correction: 0.185238 hartree
zpe.thermalcorrener: 0.196826 hartree
zpe.thermalcorrenthalpy: 0.197770 hartree
zpe.thermalcorrgfe: 0.146612 hartree
zpe.sumelectzpe: -649.858437 hartree
zpe.sumelectthermal: -649.846850 hartree
zpe.sumelectthermalent: -649.845906 hartree
zpe.sumelectthermalfe: -649.897064 hartree
dipole: -1.4646 -3.9856 1.6725
dipole: 4.5637
quadrupole: -76.6692 -82.2858 -81.5977
quadrupole: -5.0482 -2.1037 5.9988
quadrupole: 3.5150 -2.1015 -1.4134 -5.0482 -2.1037 5.9988
hfenergy: -650.0436756 hartree
pointgroup: C01 [X(C11H10O3)]
dipole: -0.5021981 -1.5977104 0.6472903 debye
dipolederiv: -0.6197732 -0.2473705 0.1068144 -0.093976 -0.974962 0.0916746 0.0768725 0.1568987 -0.358277 -0.5088075 -0.271085 0.0714721 -0.3234241 -1.135892 -0.0020332 0.0122059 -0.0603402 -0.2746466 -0.5480529 0.1042542 -0.2360244 -0.0494081 -0.7097808 0.047349 -0.389299 0.2614354 -0.6140488 -0.2402484 -0.0440443 -0.1571942 -0.0459611 0.0183994 0.0025994 -0.143257 -0.0441203 0.0305512 0.0834333 0.0048841 0.0072582 0.0107641 0.0804487 0.0460037 -0.0158528 0.0361597 0.1183377 0.3659618 0.0509767 -0.009372 -0.2117629 0.1180794 -0.0394654 -0.1009589 -0.0853422 -0.0930208 -0.3673493 0.0849393 0.0701997 0.0892683 -0.0354191 0.0085921 -0.002462 0.0293606 0.0480522 -0.2656886 0.2591115 0.0118579 0.2000845 -0.625084 0.0437214 0.0022522 0.0297518 -0.0042457 0.9526162 -0.1446279 -0.1560802 -0.1705 1.4199694 -0.0955391 -0.1296395 -0.1676304 0.1484132 -0.2073003 0.1982578 -0.0336383 0.2076401 -0.0638561 -0.045748 -0.0053689 -0.040603 -0.1417336 0.734119 0.2049648 0.4331409 0.4048854 1.4247361 -0.103343 0.7167742 -0.1702448 0.7155784 -0.0044054 -0.0969088 -0.0191255 0.1157525 0.0574971 -0.0561227 -0.0269586 0.0040562 -0.0785524 0.0699745 -0.0459713 -0.0320086 -0.0314066 0.1378985 -0.0385344 -0.049238 -0.02207 -0.1047593 0.0979661 -0.0711191 -0.0732522 -0.109605 -0.1828497 0.0225659 -0.0587803 0.0219222 -0.144934 0.0423128 -0.0081303 0.0254072 -0.0287462 -0.0264964 0.0778421 0.0482766 0.049274 0.0051685 0.0666901 -0.0424702 -0.1128901 -0.0334144 0.0244705 -0.0155954 -0.0519844 -0.0120818 -0.1118009 -0.1675506 0.0596979 0.0798243 0.0322105 0.0511307 -0.0064925 0.0369216 0.0116703 0.0803823 0.0712794 -0.0225769 0.0209891 0.0188828 -0.1148244 -0.0459026 0.0548762 -0.0650087 0.078078 0.0742907 0.0224561 -0.0220534 -0.0054921 0.1533868 -0.0117437 0.0106447 0.00071 -0.0190781 0.0355521 -0.0900474 0.056468 -0.0663635 0.0130372 0.0289773 0.0483997 0.0365286 0.124043 0.0610204 -0.029918 0.0267923 -0.0845668 0.0660494 0.0388641 0.0395785 0.0229553 0.1376736 0.0639165 0.0653339 0.0117137 0.0805181 -0.0930897 0.0201319 0.0141827 0.019085 0.1460131 -0.0980511 0.0593098 0.060051 0.0489913 0.0721215 -0.0006305 0.0613714 -0.0049176 0.1408438 0.3080945 0.0000835 -0.1303496 0.0456292 0.3250295 0.0328292 -0.1485567 -0.0074489 0.1719622 unknown
polarizability: 139.4069652|-6.181178|147.3803474|-7.0636731|-6.9096051|75.2054922 unknown
InChI: InChI=1S/C11H10O3/c12-10-6-5-9(11(13)14)7-3-1-2-4-8(7)10/h1-4,9,13H,5-6H2
charge 0 multiplicity 1
24 atoms
O  1.374465 2.836381 -0.420658
O  -2.526906 -2.013521 -0.326584
O  -2.72022 0.105103 -1.249717
C  -1.334655 -0.242418 0.801442
C  -1.526645 1.237887 1.207432
C  0.125831 -0.549599 0.427189
C  -0.901784 2.216726 0.189471
C  1.012035 0.489307 0.015421
C  0.565704 1.919807 -0.089786
C  0.606572 -1.879044 0.495261
C  -2.250099 -0.638141 -0.362051
C  2.359138 0.176345 -0.311492
C  1.945484 -2.17976 0.165918
C  2.827764 -1.147656 -0.239923
H  -1.615344 -0.901281 1.643184
H  -1.052445 1.383128 2.197008
H  -2.602918 1.460126 1.322841
H  -0.982707 3.263214 0.53041
H  -1.450071 2.141529 -0.770274
H  -0.076069 -2.679187 0.801735
H  3.010346 1.0008 -0.620741
H  2.301703 -3.214079 0.227754
H  3.866822 -1.380566 -0.496095
H  -3.0877 -2.258505 -1.112543
