program: Gaussian 09
title: 000253255
version: EM64L-G09RevD.01
frameworkgroup: C1[X(C9H10ClN3O2)]
method: RPBEPBE
basis: SDD
operation: Freq
keyword: #p
keyword: freq=noraman
keyword: PBEPBE/SDD
title: #p freq=noraman PBEPBE/SDD
converged: YES YES NO NO
title: Mulliken charges:
elementType: Cl O O N N N C C C C C C C C C H H H H H H H H H H
charge: -0.052361 -0.270958 -0.239456 -0.374740 -0.160695 0.036811 -0.518161 0.505104 -0.353295 -0.430980 -0.206256 -0.198847 0.350294 -0.107557 -0.623075 0.268725 0.236157 0.345550 0.248068 0.238986 0.257855 0.257968 0.276640 0.256788 0.257436
chargesum: 0.00000
title: Mulliken charges with hydrogens summed into heavy atoms:
elementType: Cl O O N N N C C C C C C C C C
charge: -0.052361 -0.270958 -0.239456 -0.029190 -0.160695 0.036811 -0.013280 0.505104 -0.105227 -0.191994 0.051599 0.059121 0.350294 -0.107557 0.167789
polarizability: 1.92643239e+02 4.07321720e+00 1.15958724e+02 1.02721751e+01 -5.87758369e+00 1.03506114e+02
1716.lowfreq: -7.6692 0.0005 0.0010 0.0021 3.4023 4.9641 15.4501 25.8488 33.0074
frequency: 14.3032 25.7630 32.9846 92.1939 100.8043 138.7288 152.1469 195.8331 199.4869 235.8898 275.5727 305.0847 321.7818 355.7496 390.6041 401.8101 409.4517 448.8203 479.1326 548.5722 626.4491 630.5896 701.0843 707.9236 723.0244 739.8537 796.0997 823.4646 831.5130 832.3207 911.5627 948.4358 968.3254 994.1566 1002.2775 1040.6628 1072.5633 1111.4399 1116.6119 1148.8835 1184.1665 1195.0777 1213.6129 1242.8539 1277.4939 1296.6808 1344.4451 1363.6677 1384.2490 1402.5090 1413.6873 1462.3175 1470.4472 1471.4766 1482.2803 1502.1547 1589.7119 1603.5882 1660.9131 2989.7222 3006.2353 3049.6084 3091.2055 3129.8766 3140.8433 3149.0224 3170.4410 3173.3910 3500.9110
redmass: 5.0716 5.0367 7.8531 4.9423 7.6707 1.3670 2.6905 5.2987 6.9954 7.7078 4.2771 5.0021 3.8505 3.4865 6.4006 6.6688 3.0531 5.7602 4.2076 3.8666 6.8648 4.8794 4.9134 2.0112 1.8965 4.9647 3.5795 2.2567 1.6759 1.7214 2.4484 1.3627 1.3749 3.2966 3.7815 3.5066 2.7553 1.3492 1.3267 2.7717 1.1221 2.3533 2.7390 1.2149 3.5305 1.3018 1.7588 8.5281 5.0009 2.1895 1.1960 1.0433 1.2164 1.1809 1.7048 1.8911 7.2813 6.1582 9.6179 1.0622 1.0336 1.0996 1.1010 1.0900 1.0894 1.1010 1.0952 1.0963 1.0777
irintensity: 0.0186 0.3200 0.1942 12.2189 0.4233 0.7688 0.6491 4.6736 7.7812 3.0486 3.8247 5.1720 10.8949 27.1275 3.8714 10.6806 0.1961 1.2360 7.4913 38.0186 0.4111 16.0383 0.6937 73.8124 62.6400 20.3611 45.0358 8.1549 42.8322 36.5978 173.4582 8.0550 1.2332 44.8879 70.6979 26.0178 38.9064 18.1825 0.4650 77.8993 0.9052 12.2917 2.0140 46.5379 39.6112 10.5441 18.9724 135.8232 5.2404 20.4073 41.7830 20.7052 84.8607 16.3902 26.1577 424.5049 1.9644 8.4062 261.0639 34.5672 13.6082 7.9565 12.6099 10.6494 7.1212 0.2500 6.3026 0.1919 48.4484
temp: 298.150 k
press: 1.00000 atm
elementType: 17 8 8 7 7 7 6 6 6 6 6 6 6 6 6 1 1 1 1 1 1 1 1 1 1
symmnumber: 1
zpe: 483378.3 jmol-1
zpe.correction: 0.184109 hartree
zpe.thermalcorrener: 0.198776 hartree
zpe.thermalcorrenthalpy: 0.199720 hartree
zpe.thermalcorrgfe: 0.139109 hartree
zpe.sumelectzpe: -1122.572512 hartree
zpe.sumelectthermal: -1122.557845 hartree
zpe.sumelectthermalent: -1122.556901 hartree
zpe.sumelectthermalfe: -1122.617513 hartree
dipole: -0.4007 -1.4871 0.4815
dipole: 1.6137
quadrupole: -101.5202 -100.2103 -93.4500
quadrupole: -0.5808 7.1423 -12.3681
quadrupole: -3.1267 -1.8168 4.9435 -0.5808 7.1423 -12.3681
hfenergy: -1122.7566215 hartree
pointgroup: C01 [X(C9H10Cl1N3O2)]
dipole: -0.1483103 -0.0144438 0.6171301 debye
dipolederiv: -0.7482953 -0.0839688 0.2823471 -0.0891642 -0.0951536 0.0098127 0.3311747 0.0126822 -0.2531004 -0.7283639 -0.0192213 -0.1214067 -0.2937977 -0.9319776 0.2319138 -0.0680956 0.2872566 -0.5387408 -0.6203571 0.5283465 -0.4487929 0.0896469 -0.4334662 0.1466868 -0.3183385 0.4538288 -0.5415366 -1.4532132 -0.2895513 -0.1407649 -0.4110925 -0.529815 -0.1035458 -0.1456506 -0.060145 -0.4852975 -0.6143994 0.0888168 -0.2711531 0.5624651 -0.744901 0.5958864 -0.6192072 0.3647483 -0.5740469 0.0863346 -0.4060407 0.2671073 -0.530916 0.8155553 -0.6638695 0.3632299 -0.683678 0.4516915 0.7296929 0.0313143 0.0734899 -0.3180706 0.1098576 0.0640553 0.2682536 0.1027689 0.3627204 0.1080321 0.0435008 -0.0999198 0.1257528 -0.0204558 -0.0458633 -0.1699527 -0.0442536 -0.0909019 -0.0361813 0.0619269 0.0251933 0.0364849 -0.0677013 0.0879693 0.0334328 0.0698792 -0.0218703 -0.0627617 0.0250035 -0.036493 0.0797517 -0.0805686 0.0886866 0.0182836 0.108172 0.0452556 -0.2990682 -0.035398 0.0683957 -0.0450762 -0.0743039 0.0698906 0.063795 0.0676023 -0.0273841 -0.2353356 0.0398253 0.1305386 0.0366465 -0.0574825 0.0355159 0.1861054 0.0452228 -0.1339841 1.9031102 0.0978874 0.6721666 0.5935929 1.2402946 -0.3211482 0.7169254 -0.4316814 0.8454493 1.0304848 0.1547434 -0.4680233 0.1483277 -0.0028051 0.0154658 -0.5294375 0.0145108 0.2904595 0.208778 -0.0154934 -0.0036705 0.1105171 0.0804552 0.1061843 -0.0595084 0.0516367 0.1484159 0.0380074 -0.046068 0.0640334 0.0672552 0.0161111 0.0647839 -0.010261 -0.0027114 0.0940369 -0.0489117 -0.0254217 -0.0552316 0.0344264 0.0249256 -0.1441508 -0.0587895 -0.0965414 -0.0813521 0.3563421 -0.0175804 -0.0260077 -0.0788874 0.2057054 0.0312485 -0.0457067 0.0335209 0.269689 0.0129588 -0.0877943 -0.0398624 -0.1097775 0.073543 -0.0527586 -0.054451 -0.048184 0.0701895 0.0807158 0.0106107 0.0729313 0.0042392 0.0996864 -0.0883823 0.0502781 -0.094389 -0.0435285 0.0858546 -0.0049833 0.038509 0.0011911 0.1167863 -0.075184 0.039908 -0.0783461 0.0037956 0.0129454 -0.0775892 -0.0352688 -0.0810869 0.101157 -0.0575262 -0.0233812 -0.053544 0.0934561 0.1883803 0.0452421 -0.0079556 -0.0110029 0.0426277 0.0386675 0.0328288 0.0750262 0.1158862 0.0572641 -0.0263388 0.0207556 -0.0174053 0.0799013 0.0116016 -0.0279374 -0.0642494 -0.0770694 -0.0520139 0.0082315 0.0390826 0.0959795 0.0320241 -0.0459405 0.0265019 -0.0291323 0.0777671 unknown
polarizability: 189.5548687|19.788793|104.2973357|-1.8443429|0.7868921|118.2558718 unknown
InChI: InChI=1S/C9H10ClN3O2/c1-13(12-15)9(14)11-6-7-2-4-8(10)5-3-7/h2-5,11H,6H2,1H3
charge 0 multiplicity 1
25 atoms
Cl 5.447297 0.541291 -1.295918
O  -2.211914 -1.910465 1.007336
O  -4.06381 1.27958 -1.740101
N  -1.157108 0.155989 0.640718
N  -3.225125 -0.328431 -0.416084
N  -3.099842 0.945265 -0.968802
C  -0.003217 -0.099577 1.517219
C  1.333572 0.079957 0.805147
C  1.578549 -0.541662 -0.445862
C  2.364435 0.846166 1.40036
C  2.826064 -0.406181 -1.091535
C  3.622427 0.990986 0.77127
C  -2.157207 -0.767645 0.475474
C  3.831803 0.360025 -0.468747
C  -4.377874 -1.197552 -0.704093
H  -0.118317 -1.136409 1.88376
H  -0.04958 0.566835 2.400294
H  -1.245036 1.046683 0.141216
H  0.790515 -1.137177 -0.9204
H  2.192205 1.339257 2.364605
H  3.014668 -0.887297 -2.055543
H  4.41643 1.58427 1.233433
H  -4.230761 -2.133679 -0.14781
H  -4.440468 -1.393367 -1.788328
H  -5.311809 -0.700163 -0.390512
