program: Gaussian 09
title: 000253256
version: EM64L-G09RevD.01
frameworkgroup: C1[X(C9H11N7O3)]
method: RPBEPBE
basis: SDD
operation: Freq
keyword: #p
keyword: freq=noraman
keyword: PBEPBE/SDD
title: #p freq=noraman PBEPBE/SDD
converged: YES YES NO NO
title: Mulliken charges:
elementType: O O O N N N N N N N C C C C C C C C C H H H H H H H H H H H
charge: -0.199874 -0.239694 -0.216854 -0.175868 -0.384775 -0.377830 -0.020486 0.000724 -0.135849 0.007545 -0.365485 0.314320 -0.376892 -0.122731 -0.241424 0.024590 -0.235558 0.327343 -0.611909 0.234070 0.255643 0.268703 0.255554 0.267196 0.342417 0.347728 0.251821 0.277935 0.265457 0.264183
chargesum: 0.00000
title: Mulliken charges with hydrogens summed into heavy atoms:
elementType: O O O N N N N N N N C C C C C C C C C
charge: -0.199874 -0.239694 -0.216854 -0.175868 -0.042357 -0.030102 -0.020486 0.000724 -0.135849 0.007545 0.124228 0.314320 0.147364 -0.122731 0.025773 0.024590 0.016263 0.327343 0.195666
polarizability: 2.20066148e+02 7.83992618e+00 1.87554332e+02 -1.30012617e+01 -1.62830424e+00 8.03427929e+01
1716.lowfreq: -4.2151 0.0005 0.0006 0.0007 3.7457 5.2722 26.4103 39.0169 58.3456
frequency: 26.2084 39.0055 58.3378 67.5077 83.4567 89.6318 112.4482 116.5762 161.0170 181.4178 200.5636 238.7877 265.5093 289.4093 317.4075 337.6641 354.6303 390.4421 434.6371 470.9820 481.8182 492.0548 497.8775 513.4856 569.1921 586.0300 626.5212 660.6758 669.6277 673.8770 704.8484 745.0608 757.6744 777.5005 790.8321 814.7100 860.3499 873.9468 905.5731 916.5109 934.7186 959.4975 1021.5282 1035.2596 1070.5374 1094.4185 1114.9164 1140.4359 1161.2227 1185.8873 1196.9432 1254.5212 1267.7959 1280.2939 1318.3844 1334.2348 1346.7632 1354.0883 1363.0880 1364.3723 1370.3803 1418.6314 1428.4420 1449.4796 1457.0682 1463.1313 1470.4594 1485.8164 1509.4582 1524.3015 1594.4887 1631.4996 1660.5178 3007.7629 3008.4230 3031.2492 3076.4515 3095.3765 3099.8174 3127.2041 3148.5651 3225.8457 3366.9816 3549.0634
redmass: 5.6204 7.5676 7.4983 8.0758 5.2888 5.6830 1.1099 7.3823 4.3702 7.4249 4.4258 4.2599 6.4615 4.1421 4.1575 7.4218 3.6530 6.2741 4.5535 3.8118 5.6647 4.6650 4.4097 3.6635 1.3365 4.0078 3.4022 11.4947 5.0434 5.7664 9.4143 4.3834 2.0281 1.3590 3.3406 3.6289 5.1053 2.7686 1.4388 2.7156 6.9492 3.2555 3.3018 4.9256 2.8114 3.6557 1.3322 2.7919 2.6552 1.9989 2.2354 1.5331 2.6318 2.7671 1.4140 4.2440 1.6974 1.4559 4.3589 1.4927 1.7558 1.1878 3.3243 1.1116 1.0484 1.1924 1.1004 1.7916 2.8238 6.2836 5.4714 12.1261 9.1142 1.0335 1.0627 1.0608 1.1013 1.1011 1.1056 1.0930 1.1014 1.0983 1.0829 1.0782
irintensity: 3.6095 1.0279 5.0736 0.7528 10.0488 12.8843 0.9789 1.8335 2.0679 0.5016 1.8501 0.2908 10.6563 3.9728 11.3154 0.6600 11.5602 0.5848 1.5081 3.9984 0.9965 6.1527 0.8992 6.3124 238.0527 25.3970 14.8678 6.5605 0.2273 9.9309 7.3845 14.2082 39.8836 22.2859 9.1849 17.0279 1.2795 16.3753 6.8554 153.1528 19.6525 63.0287 53.9416 3.7879 16.2957 49.2624 0.8189 16.8282 85.0310 37.1473 11.1896 2.6777 1.3167 73.7871 26.5729 33.9872 21.0358 2.0424 75.3912 30.4672 30.7667 37.2083 7.3561 38.8921 24.7876 19.7982 19.1220 151.0712 64.6534 285.8797 110.8638 450.2742 224.3085 6.7114 21.3356 13.1583 13.0884 7.6763 3.9531 10.7426 0.1577 0.1305 444.7904 39.0075
temp: 298.150 k
press: 1.00000 atm
elementType: 8 8 8 7 7 7 7 7 7 7 6 6 6 6 6 6 6 6 6 1 1 1 1 1 1 1 1 1 1 1
symmnumber: 1
zpe: 575123.4 jmol-1
zpe.correction: 0.219053 hartree
zpe.thermalcorrener: 0.236343 hartree
zpe.thermalcorrenthalpy: 0.237287 hartree
zpe.thermalcorrgfe: 0.172289 hartree
zpe.sumelectzpe: -957.033616 hartree
zpe.sumelectthermal: -957.016326 hartree
zpe.sumelectthermalent: -957.015381 hartree
zpe.sumelectthermalfe: -957.080380 hartree
dipole: 11.9783 5.2452 0.0983
dipole: 13.0767
quadrupole: -155.2775 -113.6148 -106.6107
quadrupole: -20.4503 6.3067 1.8915
quadrupole: -30.1098 11.5529 18.5570 -20.4503 6.3067 1.8915
hfenergy: -957.2526689 hartree
pointgroup: C01 [X(C9H11N7O3)]
dipole: 4.7108495 -2.0670384 0.0625398 debye
polarizability: 218.0706831|-9.4635485|187.0931583|20.4340597|7.0128813|82.7994318 unknown
InChI: InChI=1S/C9H11N7O3/c1-15(14-19)9(18)10-2-3-16-5-13-6-7(16)11-4-12-8(6)17/h4-5,10-11H,2-3H2,1H3
charge 0 multiplicity 1
30 atoms
O  -4.725811 1.376773 -0.346322
O  3.694963 -1.71949 0.546691
O  2.609186 2.713308 0.53516
N  -1.203695 -1.676313 0.193318
N  -0.681447 0.787189 0.460368
N  1.806671 -0.9743 -0.632666
N  -3.4436 -1.44419 -0.265242
N  -2.596218 2.251659 0.179878
N  3.338989 0.597194 0.267406
N  2.279103 1.503367 0.292496
C  0.053661 -2.393525 0.469597
C  -1.493291 -0.310308 0.217946
C  1.123808 -2.276494 -0.647087
C  -2.872435 -0.173219 -0.062224
C  -2.439289 -2.308585 -0.108113
C  -3.514229 1.152131 -0.100604
C  -1.323143 2.041432 0.422168
C  2.977635 -0.800999 0.073295
C  4.713209 0.994244 0.618661
H  -0.210574 -3.458633 0.592279
H  0.483949 -2.052098 1.429564
H  1.888959 -3.055366 -0.487168
H  0.661037 -2.436869 -1.635721
H  -2.513496 -3.391895 -0.183258
H  0.343154 0.768629 0.572706
H  1.387727 -0.175452 -1.112314
H  -0.654119 2.889735 0.613634
H  5.295608 0.075444 0.775592
H  4.698456 1.603148 1.538557
H  5.153231 1.601584 -0.191001
