program: Gaussian 09
title: 000257305
version: EM64L-G09RevD.01
frameworkgroup: C1[X(C12H10BrNO3)]
method: RPBEPBE
basis: SDD
operation: Freq
keyword: #p
keyword: freq=noraman
keyword: PBEPBE/SDD
title: #p freq=noraman PBEPBE/SDD
converged: YES YES NO NO
title: Mulliken charges:
elementType: Br O O O N C C C C C C C C C C C C H H H H H H H H H H
charge: 0.011851 -0.256873 -0.216621 -0.212948 -0.412149 0.006933 0.085415 0.388890 0.129030 0.133830 -0.379581 -0.370726 -0.213001 -0.187911 -0.194132 -0.228117 -0.681749 0.351725 0.288021 0.295333 0.238884 0.238814 0.248769 0.250936 0.221482 0.231904 0.231991
chargesum: 0.00000
title: Mulliken charges with hydrogens summed into heavy atoms:
elementType: Br O O O N C C C C C C C C C C C C
charge: 0.011851 -0.256873 -0.216621 -0.212948 -0.060424 0.006933 0.085415 0.388890 0.129030 0.133830 -0.091560 -0.075393 0.264697 0.060858 0.056804 -0.228117 0.003629
polarizability: 3.13680188e+02 1.29353818e+01 1.78836891e+02 -5.12098006e-02 -1.52841923e-01 6.90311417e+01
1716.lowfreq: -0.0006 0.0004 0.0006 0.7801 1.7076 5.7285 33.0656 41.9706 61.4306
frequency: 33.0446 41.9696 61.4294 74.0753 77.9249 113.3213 144.5160 156.6673 193.3630 213.6215 228.4091 239.8144 299.6125 316.2231 332.5594 356.8475 377.8493 408.5146 435.6437 470.9836 555.5474 582.4801 585.0492 621.6468 628.4888 689.7306 706.4303 714.3763 726.9981 759.0619 782.5514 800.6425 839.0192 852.6399 899.2291 976.1743 985.7053 992.7585 993.9661 1011.8935 1066.1147 1093.9024 1110.0875 1125.6915 1131.7994 1191.9889 1206.7316 1254.9032 1293.0790 1302.2037 1306.9485 1323.1637 1357.7559 1373.9183 1401.3552 1404.1541 1461.1669 1462.2780 1474.9416 1483.7412 1555.3659 1590.3565 1605.1564 1641.3145 1665.2208 2997.6118 3026.1877 3087.1433 3095.1380 3115.2744 3160.3628 3163.4406 3178.1342 3190.2323 3588.2789
redmass: 3.7047 6.9064 5.8634 5.5454 1.8045 7.2512 5.7174 12.4262 14.1152 5.0415 7.0785 1.2572 4.5110 4.7963 7.7696 8.1548 7.5936 2.9624 6.6710 4.6262 4.7898 1.0806 6.0914 7.6287 10.3324 6.7682 4.9894 5.1040 7.8354 6.2824 5.4914 1.0964 1.2864 1.5448 5.8058 1.3456 3.1895 1.3448 4.8166 2.8205 2.5598 4.1110 2.1966 1.4312 1.7024 5.0647 1.1832 1.1384 5.4850 1.9962 1.3712 2.3062 2.9973 2.3080 1.2685 3.1384 1.0860 1.0398 2.3590 1.0675 7.1482 6.1908 8.8496 7.5144 12.3827 1.0360 1.0583 1.1054 1.0982 1.1053 1.0892 1.0900 1.0965 1.0953 1.0806
irintensity: 0.8754 0.0080 0.1863 0.4572 2.1349 1.5943 0.6205 5.1513 0.8239 0.1747 0.2962 1.0007 6.1754 2.8466 0.0204 9.2513 22.7826 0.0012 0.5099 20.9652 13.0076 118.1576 2.9699 0.6382 3.4738 31.0098 20.8308 6.1439 10.4109 1.4984 38.4459 4.2957 8.2482 72.4958 21.8966 2.1090 57.5510 1.3364 41.7127 57.9933 46.0593 22.6748 15.9827 6.8756 0.8405 114.1815 18.4594 0.1241 393.4588 77.8717 26.4281 261.0107 1.5635 75.1150 28.7051 8.6537 21.0133 14.1119 86.8080 4.5412 2.7689 128.0046 68.0826 558.1299 100.0804 14.4599 17.6175 0.1420 25.9276 41.8125 3.5220 2.3961 8.5909 5.0134 117.0471
temp: 298.150 k
press: 1.00000 atm
elementType: 35 8 8 8 7 6 6 6 6 6 6 6 6 6 6 6 6 1 1 1 1 1 1 1 1 1 1
symmnumber: 1
zpe: 512994.1 jmol-1
zpe.correction: 0.195389 hartree
zpe.thermalcorrener: 0.211320 hartree
zpe.thermalcorrenthalpy: 0.212264 hartree
zpe.thermalcorrgfe: 0.149735 hartree
zpe.sumelectzpe: -755.957545 hartree
zpe.sumelectthermal: -755.941615 hartree
zpe.sumelectthermalent: -755.940670 hartree
zpe.sumelectthermalfe: -756.003200 hartree
dipole: 2.7145 2.6358 0.0067
dipole: 3.7837
quadrupole: -111.6426 -99.8832 -109.5248
quadrupole: 5.3562 0.0119 -0.0349
quadrupole: -4.6258 7.1337 -2.5079 5.3562 0.0119 -0.0349
hfenergy: -756.1529345 hartree
pointgroup: C01 [X(C12H10Br1N1O3)]
dipole: 0.9742999 -1.1225625 0.0810561 debye
polarizability: 307.4145374|-24.2072325|181.8776505|27.402383|0.0982116|72.2560325 unknown
InChI: InChI=1S/C12H10BrNO3/c1-2-17-10-9(11(15)14-12(10)16)7-3-5-8(13)6-4-7/h3-6,14H,2H2,1H3
charge 0 multiplicity 1
27 atoms
Br -5.756327 -0.027577 -0.521321
O  1.201647 -1.681808 0.255216
O  0.675146 3.138712 0.322263
O  3.906853 -0.236896 0.609739
N  2.525256 1.690067 0.500094
C  0.430287 0.644169 0.228105
C  1.41837 -0.332317 0.317127
C  -1.0186 0.488976 0.053511
C  1.134877 1.969848 0.345823
C  2.781086 0.312695 0.49285
C  -1.611791 -0.80718 -0.046673
C  -1.878124 1.627554 -0.022089
C  2.343388 -2.659214 0.359022
C  -3.001542 -0.961513 -0.215157
C  -3.268946 1.480368 -0.190626
C  -3.819116 0.185461 -0.285827
C  1.718599 -4.043111 0.241449
H  3.238774 2.412052 0.60193
H  -0.979459 -1.695566 0.007562
H  -1.448804 2.630007 0.051845
H  3.060157 -2.444613 -0.451825
H  2.849909 -2.500997 1.32639
H  -3.439663 -1.960754 -0.290337
H  -3.911832 2.363287 -0.246611
H  2.511988 -4.809518 0.308299
H  0.994967 -4.223187 1.054645
H  1.201499 -4.164649 -0.725602
