program: Gaussian 09
title: 000257304
version: EM64L-G09RevD.01
frameworkgroup: C1[X(C5H13N3)]
method: RPBEPBE
basis: SDD
operation: Freq
keyword: #pfreq=noraman
keyword: PBEPBE/SDD
title: #p freq=noraman PBEPBE/SDD
converged: YES YES NO NO
title: Mulliken charges:
elementType: N N N C C C C C H H H H H H H H H H H H H
charge: -0.381536 -0.105187 -0.674105 -0.310169 0.252414 -0.701212 -0.424579 -0.665420 0.236731 0.216530 0.273448 0.149461 0.226340 0.200677 0.224804 0.220524 0.203541 0.230359 0.211916 0.302053 0.313409
chargesum: 0.00000
title: Mulliken charges with hydrogens summed into heavy atoms:
elementType: N N N C C C C C
charge: -0.108088 -0.105187 -0.058643 0.143093 0.252414 -0.055207 -0.048778 -0.019604
polarizability: 1.01155565e+02 4.49303217e+00 7.72935809e+01 2.62783465e+00 3.99259838e+00 5.84442845e+01
1716.lowfreq: -23.7908 -2.7070 -0.0008 -0.0003 0.0006 8.4781 26.2366 46.3152 111.6809
frequency: 22.4509 45.9289 111.6636 136.3307 183.0234 227.5990 262.9296 310.4550 325.8866 367.4344 418.3772 427.5164 453.8063 506.2569 633.6801 664.6938 780.0063 793.1386 808.9899 904.6970 959.5091 1018.7406 1062.8182 1078.0193 1111.7951 1134.7257 1155.4490 1179.0247 1246.9129 1259.6746 1304.0562 1328.4993 1358.8950 1377.3179 1391.2043 1461.3809 1469.0802 1476.8807 1479.8257 1484.9500 1496.6025 1504.1922 1614.6027 1651.5972 2861.5059 2957.8437 2974.7802 2976.3664 3017.0511 3049.9852 3072.2158 3075.7915 3086.4431 3089.3748 3523.0722 3551.8778 3693.5544
redmass: 2.6812 2.1566 2.8457 2.7890 1.8706 1.1945 1.3346 2.2447 1.6348 1.6008 1.3736 1.5231 3.1221 1.6621 3.1076 6.8070 1.5049 1.1402 1.7769 1.7046 2.6011 2.1101 1.9753 2.0392 1.9927 1.5301 2.6148 2.6559 1.1333 1.2218 1.6746 1.2575 1.5958 1.2098 1.2454 1.0551 1.2419 1.0828 1.0459 1.4495 1.0828 1.1198 1.2684 3.9779 1.0720 1.0708 1.0378 1.0352 1.0874 1.0922 1.0994 1.0961 1.1000 1.1000 1.0758 1.0449 1.1025
irintensity: 0.3602 1.0992 6.0449 4.6279 1.4296 3.0369 0.6724 8.0328 52.3528 50.3649 120.2794 189.0811 12.1420 95.5607 9.5512 16.8994 7.2792 1.8483 0.3224 2.7710 11.4702 1.4480 6.9461 10.5853 4.3906 5.4964 1.1364 39.9186 9.1211 46.9242 45.9965 34.4826 11.5138 14.9686 26.0998 23.3704 71.0805 33.4809 7.7588 124.0324 23.0265 24.7125 123.5717 396.1364 135.6918 49.6965 43.8012 33.5096 31.3206 2.1095 70.9910 58.1855 37.4010 41.7715 6.1617 16.2501 17.0933
temp: 298.150 k
press: 1.00000 atm
elementType: 7 7 7 6 6 6 6 6 1 1 1 1 1 1 1 1 1 1 1 1 1
symmnumber: 1
zpe: 484012.0 jmol-1
zpe.correction: 0.184350 hartree
zpe.thermalcorrener: 0.194966 hartree
zpe.thermalcorrenthalpy: 0.195910 hartree
zpe.thermalcorrgfe: 0.147560 hartree
zpe.sumelectzpe: -361.906403 hartree
zpe.sumelectthermal: -361.895788 hartree
zpe.sumelectthermalent: -361.894843 hartree
zpe.sumelectthermalfe: -361.943193 hartree
dipole: 0.4036 2.6267 0.9685
dipole: 2.8285
quadrupole: -43.9215 -45.9373 -53.1410
quadrupole: -1.3978 -0.5460 1.1585
quadrupole: 3.7451 1.7293 -5.4744 -1.3978 -0.5460 1.1585
hfenergy: -362.0907535 hartree
pointgroup: C01 [X(C5H13N3)]
dipole: 0.2310917 0.9102639 0.5969629 debye
dipolederiv: -1.3468635 0.2356415 -0.0695355 0.2924184 -0.3460433 -0.1127972 -0.3591874 -0.0985019 -0.5953028 -1.0757767 -0.1578627 -0.1016239 -0.5018504 -0.6714285 -0.1379662 -0.3508522 -0.2024902 -0.5396338 -0.5280776 0.0881763 0.2284786 0.020151 -1.224189 -0.142172 0.1878701 -0.0763723 -0.540841 0.3787112 -0.1602109 -0.0596978 -0.3785012 0.3759346 0.086362 -0.0882795 0.0627459 0.3769125 1.7960243 -0.1566612 0.1002696 0.2859341 1.1537421 0.5007678 0.3478165 0.5817905 0.4759172 -0.0900542 0.0707946 -0.0366424 0.0662967 0.0794096 -0.0136421 -0.0309094 -0.0263075 0.06204 0.7206005 0.0981903 0.0972703 0.0328668 0.344909 -0.0439901 0.1400342 0.0075668 0.2582819 -0.0530754 -0.0624136 0.0300755 0.0138717 0.0296727 0.080872 0.0541437 0.0564519 -0.0532626 0.02676 -0.0948794 0.0333522 -0.0251194 -0.056036 0.0380901 0.05262 0.0440338 0.0434789 -0.0020788 0.0316148 -0.0193267 0.1013255 0.0149177 -0.0064169 0.0735159 -0.06292 -0.2052862 0.1210533 -0.038738 0.014748 -0.0370361 0.0455342 -0.0305762 0.18198 0.0185886 0.3212183 -0.181976 0.0469707 -0.0232201 0.1922159 -0.2554468 0.0798807 0.0268507 0.0032472 0.0410278 -0.0329437 -0.0518452 -0.0605361 -0.0763147 0.0194825 -0.0970928 -0.1083245 -0.0657971 -0.1195963 -0.0115694 -0.0785936 0.0265386 -0.1601829 -0.0945853 0.0735539 0.0339223 0.0861956 0.0540669 0.0813913 -0.0037354 0.0042362 -0.0272194 0.0990414 -0.0105309 -0.0636737 0.0144607 -0.170795 -0.0034386 0.0888725 0.0246851 0.1374738 -0.0836695 -0.0718133 0.055262 -0.0846318 0.0745618 -0.2732535 -0.0443605 0.0079339 -0.0232913 0.0881307 0.0116253 0.0276916 0.0286161 0.0828506 0.0942476 0.1031824 -0.006641 0.0443128 -0.1304381 0.0411243 -0.0028947 0.0040438 0.0732203 0.0746064 -0.0381465 -0.07391 -0.03089 0.0208775 -0.115277 -0.0300908 -0.0651294 -0.1101428 0.1909926 0.0593208 -0.0798118 0.0291711 0.2909693 -0.0615121 -0.1104613 -0.1598968 0.2054066 0.1147203 0.0646833 -0.0366427 0.0443677 0.2992152 -0.0684891 -0.0370335 -0.0656938 0.2658777 unknown
polarizability: 101.6950654|2.2412924|74.2418798|3.1185292|7.4031879|60.956485 unknown
InChI: InChI=1S/C5H13N3/c1-3-7-5(6)8-4-2/h7H,3-4,6H2,1-2H3
charge 0 multiplicity 1
21 atoms
N  1.302508 0.472545 0.05902
N  -0.80029 -0.265166 -0.708625
N  -0.541966 1.850435 0.489226
C  1.95823 -0.744549 -0.449391
C  -0.083495 0.644345 -0.086569
C  3.41785 -0.809486 0.031778
C  -2.274077 -0.186193 -0.692322
C  -2.87791 -0.876023 0.555746
H  1.380563 -1.611593 -0.086253
H  1.90879 -0.788961 -1.558246
H  1.866399 1.326149 0.053044
H  -2.680391 0.854054 -0.76093
H  -2.638722 -0.706548 -1.597525
H  4.00652 0.054018 -0.335865
H  3.469794 -0.817506 1.135325
H  3.904298 -1.726219 -0.346253
H  -3.983638 -0.886651 0.508853
H  -2.521164 -1.919396 0.615506
H  -2.570899 -0.35986 1.484103
H  -0.026783 2.275453 1.256695
H  -1.515916 2.113152 0.370187
