program: Gaussian 09
title: 000257302
version: EM64L-G09RevD.01
frameworkgroup: C1[X(C9H13N3)]
method: RPBEPBE
basis: SDD
operation: Freq
keyword: #pfreq=noraman
keyword: PBEPBE/SDD
title: #p freq=noraman PBEPBE/SDD
converged: YES YES NO NO
title: Mulliken charges:
elementType: N N N C C C C C C C C C H H H H H H H H H H H H H
charge: -0.455322 -0.122803 -0.655355 0.419874 -0.435667 -0.399026 0.215049 -0.435275 -0.194758 -0.209308 -0.265301 -0.668535 0.322369 0.231097 0.274474 0.157164 0.231349 0.224868 0.222770 0.228148 0.207931 0.236978 0.208683 0.333444 0.327153
chargesum: 0.00000
title: Mulliken charges with hydrogens summed into heavy atoms:
elementType: N N N C C C C C C C C C
charge: -0.132953 -0.122803 0.005242 0.419874 -0.204570 -0.124552 0.215049 -0.046763 0.030110 0.013462 -0.037153 -0.014942
polarizability: 2.01654399e+02 -6.66556040e+00 1.12694130e+02 -1.36507097e+00 1.73543029e+00 6.62142886e+01
1716.lowfreq: -14.6558 -0.0005 0.0004 0.0007 2.0454 8.3084 40.3383 45.5341 81.6305
frequency: 40.0777 45.4130 81.5803 107.2073 157.1315 204.9437 240.1669 295.1992 315.2853 343.7111 387.9829 400.2631 428.7413 463.9186 501.9446 558.6225 590.2985 614.9572 628.2214 686.4889 702.7275 756.3721 804.8695 818.2761 838.6237 848.1132 903.8252 945.3716 969.1174 982.6326 986.5550 1018.4407 1032.0986 1067.7043 1087.5644 1104.5079 1158.4652 1171.0277 1189.9919 1250.2966 1264.7856 1325.3115 1332.3209 1373.3674 1383.8757 1406.1017 1422.3276 1462.9874 1469.6132 1480.1231 1496.8056 1501.3894 1587.0041 1611.8140 1619.5372 1654.4089 2863.1695 2977.8865 3021.8038 3072.0110 3089.0237 3118.9501 3127.5654 3141.6079 3160.5828 3171.2013 3540.9140 3544.4161 3685.9425
redmass: 4.0857 3.3271 3.3172 3.3885 3.2709 1.5993 2.1509 4.7579 2.1151 3.0486 1.4559 1.9408 1.8079 2.0234 2.6369 1.4964 3.5184 5.6077 3.0667 4.7728 2.2597 1.6514 1.1924 3.0580 1.5343 2.6207 1.4302 2.8925 1.3889 4.4056 1.3678 2.4652 2.0085 1.9321 1.6006 1.8105 1.8741 1.0521 1.1096 1.8208 1.2503 1.4701 1.2663 3.6496 1.3111 3.6127 2.1779 1.0508 1.9986 1.0754 2.8480 1.1108 5.9801 1.7198 3.2668 2.8892 1.0712 1.0357 1.0883 1.0997 1.0996 1.0865 1.0872 1.0937 1.0955 1.0989 1.0462 1.0749 1.1029
irintensity: 0.5479 1.1769 2.6790 2.1164 1.3417 2.5995 3.9196 3.6647 3.5253 0.5113 78.2911 59.2660 113.8655 7.6478 10.1382 88.6168 6.5934 5.6594 41.7248 10.5875 54.5061 81.9821 1.2017 1.3716 0.8554 6.1120 7.3004 12.6575 0.6152 3.8132 1.1446 4.8169 7.7206 1.8687 7.2773 17.7748 30.8948 0.7448 7.0095 34.0212 37.3815 6.5636 74.6955 3.8052 25.9969 227.5739 7.7528 12.7798 8.7520 14.4583 237.9529 18.3811 14.1994 420.5352 45.1581 514.2745 128.7521 41.2975 31.4221 84.9637 31.9651 10.6087 2.4473 30.0368 28.0123 7.8099 13.0056 42.2195 31.8113
temp: 298.150 k
press: 1.00000 atm
elementType: 7 7 7 6 6 6 6 6 6 6 6 6 1 1 1 1 1 1 1 1 1 1 1 1 1
symmnumber: 1
zpe: 548102.5 jmol-1
zpe.correction: 0.208761 hartree
zpe.thermalcorrener: 0.220841 hartree
zpe.thermalcorrenthalpy: 0.221786 hartree
zpe.thermalcorrgfe: 0.169952 hartree
zpe.sumelectzpe: -514.110586 hartree
zpe.sumelectthermal: -514.098506 hartree
zpe.sumelectthermalent: -514.097562 hartree
zpe.sumelectthermalfe: -514.149396 hartree
dipole: -0.2688 1.5934 1.8129
dipole: 2.4286
quadrupole: -66.8483 -66.5585 -75.0949
quadrupole: 5.6254 3.5374 1.9385
quadrupole: 2.6523 2.9420 -5.5943 5.6254 3.5374 1.9385
hfenergy: -514.3193473 hartree
pointgroup: C01 [X(C9H13N3)]
dipole: 0.0035489 -0.129471 0.9466585 debye
dipolederiv: -2.1838227 -0.0172502 0.2127948 0.0156872 -0.393521 0.0469006 0.0457723 0.0502028 -0.2896337 -1.5084579 -0.081489 0.2431136 -0.1140139 -0.4439881 -0.0106221 0.5693186 0.0741163 -0.6499236 -0.5603047 0.1194479 0.005312 0.112994 -0.5643121 -0.0883811 0.0531491 -0.002424 -0.9953248 1.5793768 -0.1407467 -0.3472234 -0.2484022 0.1354227 0.0193754 -0.7056756 0.0362809 0.1624016 -0.5368705 0.0819609 0.1202862 -0.0981274 -0.0720316 0.1505774 -0.1480958 0.1413321 -0.0653523 -0.2802859 0.0230363 -0.0228038 0.3164448 -0.1190929 0.0349538 0.3562806 0.0426602 -0.2276738 2.3031773 0.116511 -0.2378113 0.3988161 0.1907527 -0.024029 -0.0887029 -0.0762969 1.2274156 0.8478336 0.0251998 -0.0814682 -0.0000252 0.2587588 -0.0135314 0.0627379 -0.0845132 0.2527895 0.2097154 -0.006576 -0.0594826 0.0470022 0.0225723 0.147127 -0.0335399 0.1453831 0.0217348 0.2107569 0.0715057 0.0175031 -0.0477421 0.0237049 0.1593606 -0.0656081 0.1429311 0.007189 -0.1478795 -0.0389985 -0.0599071 -0.0125515 -0.222567 -0.0087938 -0.0111855 0.0096401 -0.1968003 -0.0577965 -0.0501027 0.0374772 -0.0096504 -0.0933918 -0.0185852 -0.0889223 -0.001571 0.070382 0.1297362 0.00371 0.0092001 -0.1529171 0.3022107 -0.0190945 0.0103137 -0.0515983 0.1827768 0.0724279 0.0404636 0.0571375 0.0161806 0.0272502 -0.1316493 0.0374306 -0.1349543 0.0324733 0.0252269 -0.0823007 -0.032557 -0.1001203 0.0774122 -0.0587009 -0.0328482 -0.0570077 0.1117208 -0.1447129 -0.0175058 -0.0093031 0.0249648 -0.0423461 0.0964324 -0.2265108 0.1564864 -0.184612 -0.1434118 0.0534972 0.0909372 0.0770925 -0.002796 -0.0655084 0.1248036 -0.0892476 -0.0122672 -0.0543112 -0.0914783 -0.0562809 -0.1108801 0.0628022 -0.0720689 -0.0622896 -0.0803819 0.0856887 0.0725179 0.0127553 0.0232023 0.0459691 0.0098225 -0.1393491 0.0395078 -0.140765 0.0135182 -0.1115891 0.0259036 0.0732022 0.0289515 0.1251147 -0.0528497 0.0762342 -0.0596983 0.1046551 -0.2603267 -0.0574834 -0.0508716 -0.0826315 0.0590682 0.014142 -0.0969054 -0.0157508 0.092513 0.1261687 0.0271043 -0.0476777 0.0121448 0.0198868 0.0681274 0.0126726 0.1224424 -0.0899891 0.0293626 0.0841552 0.1048752 0.0445254 0.0029273 -0.0625465 0.0918128 -0.1020274 -0.0389308 0.2536297 -0.0654417 0.0482803 -0.1380273 0.3075317 0.0054599 0.0961536 -0.0192859 0.158759 0.1298395 -0.0358777 -0.0379348 -0.0256843 0.3288085 0.0232535 -0.0159033 -0.0059531 0.2264903 unknown
polarizability: 198.7915701|6.7927635|84.7818493|-18.6286855|21.7723738|96.9893987 unknown
InChI: InChI=1S/C9H13N3/c1-2-11-9(10)12-8-6-4-3-5-7-8/h3-7,12H,2,10H2,1H3
charge 0 multiplicity 1
25 atoms
N  0.233594 -0.554057 -0.802273
N  2.513689 -0.280171 -1.127134
N  1.58292 -0.126338 1.116459
C  -1.051646 -0.276445 -0.282487
C  -2.156379 -1.004441 -0.813611
C  -1.30125 0.718391 0.707322
C  1.515787 -0.290883 -0.271969
C  3.89833 -0.134237 -0.641236
C  -3.466885 -0.75105 -0.36375
C  -2.618194 0.947537 1.162615
C  -3.710242 0.219598 0.637744
C  4.327826 1.351077 -0.535348
H  0.293724 -0.91706 -1.755931
H  -1.9751 -1.773704 -1.574439
H  -0.479658 1.334835 1.082727
H  4.080474 -0.639115 0.341129
H  4.558218 -0.637873 -1.371211
H  -4.300394 -1.321362 -0.789492
H  -2.790732 1.71999 1.92128
H  -4.728431 0.408806 0.993106
H  5.395688 1.433077 -0.257641
H  4.181272 1.853361 -1.507439
H  3.729224 1.897996 0.217007
H  0.814187 -0.420051 1.715843
H  2.48588 0.055218 1.54513
