program: Gaussian 09
title: 000257301
version: EM64L-G09RevD.01
frameworkgroup: C1[X(C11H19N3O3)]
method: RPBEPBE
basis: SDD
operation: Freq
keyword: #p
keyword: freq=noraman
keyword: PBEPBE/SDD
title: #p freq=noraman PBEPBE/SDD
converged: YES YES NO NO
title: Mulliken charges:
elementType: O O O N N N C C C C C C C C C C C H H H H H H H H H H H H H H H H H H H
charge: -0.219430 -0.196256 -0.430799 -0.395631 -0.014582 -0.611490 0.056354 -0.452240 -0.449479 -0.380760 0.145992 -0.004926 -0.355718 -0.356568 -0.361578 0.163925 -0.698154 0.221493 0.228244 0.204223 0.271938 0.196456 0.221849 0.194036 0.188589 0.224495 0.238034 0.193797 0.200001 0.325627 0.211970 0.214371 0.209739 0.330243 0.363140 0.323096
chargesum: 0.00000
title: Mulliken charges with hydrogens summed into heavy atoms:
elementType: O O O N N N C C C C C C C C C C C
charge: -0.219430 -0.196256 -0.100556 -0.070004 -0.014582 0.074746 0.056354 -0.002503 0.026682 0.037545 0.145992 -0.004926 0.026906 0.105961 0.032220 0.163925 -0.062074
polarizability: 1.66018289e+02 -1.90298816e+01 1.50741901e+02 -9.16956980e+00 2.02375551e+00 1.38246502e+02
1716.lowfreq: -11.5967 -0.0006 0.0002 0.0003 1.9046 8.1529 19.8263 32.7169 44.5473
frequency: 19.8049 32.5215 44.4250 54.7645 68.9653 102.4053 107.3419 122.3878 126.8613 133.3963 161.7345 176.4958 220.3142 222.7188 241.3520 272.9010 306.3835 315.0114 323.0234 332.6284 354.7692 371.8564 415.7139 484.1220 495.7732 512.2333 572.2371 601.1149 617.8671 646.4228 697.5657 710.6497 723.7516 736.7251 743.2650 760.1533 787.6724 817.8910 890.4866 895.9415 948.3833 967.1123 974.1715 991.8026 1000.9075 1023.6085 1042.5328 1056.4427 1063.9438 1079.3760 1097.9440 1117.9958 1152.3065 1174.2118 1203.9193 1218.6180 1247.3819 1262.4136 1271.2569 1286.8974 1292.5929 1299.8379 1311.9067 1314.8458 1321.5418 1340.8947 1350.3214 1360.5427 1385.2305 1387.9619 1441.5124 1455.1092 1462.4635 1463.4948 1466.7797 1475.5216 1477.0255 1484.5854 1486.3250 1562.9727 1601.0839 1635.4774 1654.5125 2954.4847 2964.9631 2967.4663 2971.2859 2971.8494 2993.2938 2995.7765 3006.0816 3019.0895 3038.5993 3050.7329 3068.0622 3070.4395 3073.3810 3104.8573 3498.5800 3541.6971 3556.3209 3693.3220
redmass: 5.6612 2.2156 2.3339 4.7999 2.2086 3.4007 2.8293 6.7411 2.9063 2.9227 4.3181 5.8133 1.3289 1.9481 5.2461 2.5955 2.4085 1.4337 3.4770 3.3215 1.1640 6.8505 4.1842 8.9021 4.4070 4.3573 1.1851 4.3281 4.0075 1.6583 7.1176 3.2275 1.1973 1.9748 2.2722 4.1685 1.2457 1.3751 1.9001 1.7725 3.3507 2.7215 2.1837 3.4607 2.1425 3.1451 2.3614 2.1818 2.5094 2.4311 1.8855 2.6628 2.0492 2.2715 2.3004 1.8285 1.3702 1.9064 1.5319 1.3268 1.0921 1.2137 1.2392 1.5500 1.4835 1.2965 1.4942 1.5417 1.2126 1.2184 1.0849 1.7676 1.1336 1.5051 1.0774 1.0427 1.0730 1.0853 1.0832 6.3983 1.6017 5.6544 3.6577 1.0586 1.0597 1.0635 1.0477 1.0492 1.0676 1.0971 1.0593 1.1006 1.1029 1.0958 1.1010 1.0992 1.1040 1.0986 1.0771 1.0456 1.0663 1.1052
irintensity: 7.6577 0.4426 1.2439 0.1496 4.4541 1.0575 0.8574 0.7737 4.6910 3.2630 0.6710 6.0524 1.1723 4.0138 3.6118 7.5240 3.9940 138.3025 4.0675 7.5997 57.6755 5.1448 2.3116 3.4254 8.6642 8.8947 242.9550 4.4354 4.3070 66.0661 21.6688 10.8220 12.2906 8.2211 5.9126 18.8092 7.2643 1.0536 3.2320 3.1892 22.2932 76.7592 19.8148 26.9698 11.7708 34.5247 18.1753 14.0266 6.9069 1.3189 6.5154 7.6617 5.2367 52.3532 4.6574 15.9448 11.0112 64.5168 72.5706 36.8216 6.8133 0.1444 3.0825 16.9714 104.5487 16.5831 3.1249 3.0903 8.3212 11.7390 19.7597 85.5751 13.6577 79.5825 1.2746 12.1603 2.3496 6.7643 17.2331 626.4714 103.8367 392.9544 233.0543 6.4395 8.7344 27.0679 90.8704 24.5143 28.8351 2.0071 28.2746 7.4571 29.3940 3.7292 57.1142 53.6129 50.3569 23.9997 21.3961 126.6316 9.3122 46.6329
temp: 298.150 k
press: 1.00000 atm
elementType: 8 8 8 7 7 7 6 6 6 6 6 6 6 6 6 6 6 1 1 1 1 1 1 1 1 1 1 1 1 1 1 1 1 1 1 1
symmnumber: 1
zpe: 783408.6 jmol-1
zpe.correction: 0.298385 hartree
zpe.thermalcorrener: 0.317624 hartree
zpe.thermalcorrenthalpy: 0.318568 hartree
zpe.thermalcorrgfe: 0.249143 hartree
zpe.sumelectzpe: -819.177830 hartree
zpe.sumelectthermal: -819.158590 hartree
zpe.sumelectthermalent: -819.157646 hartree
zpe.sumelectthermalfe: -819.227071 hartree
dipole: 4.5818 -4.2010 -4.4871
dipole: 7.6665
quadrupole: -80.3061 -103.1490 -116.3389
quadrupole: -16.4692 -10.4811 10.6687
quadrupole: 19.6252 -3.2176 -16.4075 -16.4692 -10.4811 10.6687
hfenergy: -819.4762144 hartree
pointgroup: C01 [X(C11H19N3O3)]
dipole: 1.8453932 -1.4693308 -1.8796996 debye
polarizability: 166.9819803|-17.8783893|149.4653609|-10.5663861|2.6243187|138.5593498 unknown
InChI: InChI=1S/C11H19N3O3/c1-2-3-4-5-11(6-7-15)8(16)13-10(12)14-9(11)17/h13,15H,2-7,12H2,1H3
charge 0 multiplicity 1
36 atoms
O  0.493451 0.636494 -2.233824
O  0.190681 -0.822426 2.340848
O  2.382117 3.826947 0.503763
N  1.822842 -1.043924 -1.378879
N  1.772871 -1.77282 0.928261
N  3.189219 -2.80733 -0.601788
C  0.541756 0.370158 0.231586
C  -0.935079 0.848635 0.305429
C  1.530957 1.510235 0.7152
C  -1.974883 -0.238234 -0.046871
C  0.909299 0.022198 -1.216045
C  0.794527 -0.806539 1.23635
C  -3.421791 0.29882 0.030323
C  1.419594 2.852018 -0.038843
C  -4.483912 -0.770039 -0.313452
C  2.240401 -1.857215 -0.308314
C  -5.928106 -0.229326 -0.236707
H  -1.063269 1.702015 -0.385201
H  -1.114757 1.20677 1.336003
H  2.576454 1.141425 0.646493
H  1.320292 1.687066 1.786373
H  -1.788688 -0.616428 -1.073309
H  -1.868024 -1.093693 0.647879
H  -3.613455 0.688531 1.051807
H  -3.533371 1.160456 -0.660868
H  1.557222 2.718768 -1.130239
H  0.440054 3.323244 0.132392
H  -4.288515 -1.162616 -1.332537
H  -4.371258 -1.629238 0.378561
H  2.094157 -1.249298 -2.345938
H  -6.158873 0.140034 0.78038
H  -6.66829 -1.011276 -0.488052
H  -6.073663 0.61274 -0.939677
H  3.302723 3.505392 0.327399
H  3.465101 -3.423278 0.161151
H  3.632118 -2.899467 -1.512651
