program: Gaussian 09
title: 000257298
version: EM64L-G09RevD.01
frameworkgroup: C1[X(C10H15IN2O3)]
method: RPBEPBE
basis: SDD
operation: Freq
keyword: #p
keyword: freq=noraman
keyword: PBEPBE/SDD
title: #p freq=noraman PBEPBE/SDD
converged: YES YES NO NO
title: Mulliken charges:
elementType: I O O O N N C C C C C C C C C C H H H H H H H H H H H H H H H
charge: 0.044725 -0.206504 -0.219603 -0.213065 -0.371256 -0.375258 0.099639 -0.463324 -0.365327 -0.351269 0.143544 0.157058 -0.357192 -0.817753 0.157595 -0.697359 0.239978 0.236578 0.244285 0.280048 0.200000 0.208931 0.200676 0.201203 0.301990 0.334586 0.370601 0.369947 0.212975 0.212093 0.221461
chargesum: 0.00000
title: Mulliken charges with hydrogens summed into heavy atoms:
elementType: I O O O N N C C C C C C C C C C
charge: 0.044725 -0.206504 -0.219603 -0.213065 -0.000654 -0.005311 0.099639 0.013232 0.159006 0.057661 0.143544 0.157058 0.044688 -0.181178 0.157595 -0.050830
polarizability: 1.90938415e+02 1.52310377e+01 1.45204644e+02 -2.99340233e+00 -9.88773548e-01 1.24323972e+02
1716.lowfreq: -10.0922 -6.9963 -2.2589 -0.0005 -0.0004 -0.0004 17.3746 32.9887 49.8156
frequency: 17.1170 32.8930 49.8059 60.4009 62.6048 99.3473 114.1098 124.1409 137.7466 142.0926 160.4166 214.5946 222.2660 233.0968 253.4610 295.4204 357.6889 366.2318 376.8566 428.2052 480.0210 483.1997 570.7048 605.3081 635.6230 660.0091 684.7480 721.7952 731.1687 746.2823 752.4867 762.4392 785.8800 794.7861 875.3889 894.2638 920.6878 970.2768 992.0141 999.1328 1014.0801 1058.3350 1068.8342 1080.5209 1112.4789 1138.7751 1174.7787 1203.5831 1214.5055 1238.5180 1260.1900 1289.3902 1296.8666 1305.8610 1312.6819 1332.4064 1340.6898 1356.0447 1364.6156 1377.3527 1378.7168 1391.6738 1448.6460 1456.8249 1464.7389 1470.1283 1474.5105 1478.0796 1486.0351 1610.3420 1647.3805 1680.4470 2959.5358 2971.8163 2975.1771 2999.4304 3003.7508 3004.8688 3030.2516 3066.8807 3070.1925 3074.0697 3076.4926 3078.3370 3165.7244 3515.1340 3517.0190
redmass: 11.1235 4.6107 4.1299 1.6119 3.7651 3.8336 4.3070 3.0614 5.0012 5.8910 10.2051 3.5759 1.2634 2.2908 3.2567 3.2199 11.6660 4.5851 8.4844 4.3336 9.7009 4.6282 7.0613 5.6455 4.1435 2.6349 2.6503 5.6797 1.1338 1.8552 1.8334 1.5809 1.4054 1.6904 1.7179 1.8889 1.3869 4.0741 3.1140 1.8733 2.8476 2.8518 3.3463 2.5531 2.2053 1.9098 2.0557 1.6539 1.4370 1.7357 1.3332 1.2135 1.3719 1.6619 1.2657 1.3653 1.5850 1.5552 7.6229 1.5438 2.0307 1.2135 1.0854 1.0973 1.0773 1.0910 1.0626 1.0438 1.0796 6.7130 8.3878 5.5694 1.0587 1.0595 1.0362 1.0607 1.0989 1.0591 1.1035 1.1021 1.1007 1.0881 1.0981 1.0738 1.1102 1.0758 1.0780
irintensity: 0.7265 0.5490 0.0539 0.0826 0.5244 0.7681 2.1321 0.0239 0.3021 1.4555 12.7936 0.8166 0.1003 1.3311 3.6553 4.4295 26.4516 16.2791 1.9717 2.6457 17.1096 31.7522 13.4404 8.5741 12.7439 6.6463 18.9756 3.4211 9.0497 9.3128 7.8489 2.4340 2.9071 224.2763 1.9482 4.0405 2.3711 12.3928 1.5356 0.8566 1.0471 3.7399 1.0862 1.9992 10.8227 1.9063 5.8169 11.5766 28.8737 38.3128 29.7412 21.2324 102.9750 160.1902 7.6351 17.6091 105.6280 10.7741 203.1813 2.5196 7.7665 9.4975 19.0763 2.2409 0.4284 10.0918 6.2369 12.9969 14.2233 291.1085 82.5765 622.9503 6.9455 46.9710 34.9872 6.7955 0.8494 24.8138 21.1427 3.6794 24.4019 45.0685 40.9305 23.2614 3.1159 87.4010 51.1584
temp: 298.150 k
press: 1.00000 atm
elementType: 53 8 8 8 7 7 6 6 6 6 6 6 6 6 6 6 1 1 1 1 1 1 1 1 1 1 1 1 1 1 1
symmnumber: 1
zpe: 645094.8 jmol-1
zpe.correction: 0.245704 hartree
zpe.thermalcorrener: 0.263169 hartree
zpe.thermalcorrenthalpy: 0.264113 hartree
zpe.thermalcorrgfe: 0.196591 hartree
zpe.sumelectzpe: -735.568074 hartree
zpe.sumelectthermal: -735.550609 hartree
zpe.sumelectthermalent: -735.549664 hartree
zpe.sumelectthermalfe: -735.617186 hartree
dipole: 1.7971 -0.9627 -0.2171
dipole: 2.0503
quadrupole: -117.1528 -114.3727 -119.0997
quadrupole: -7.4564 -0.9193 0.9894
quadrupole: -0.2778 2.5024 -2.2246 -7.4564 -0.9193 0.9894
hfenergy: -735.8137772 hartree
pointgroup: C01 [X(C10H15I1N2O3)]
dipole: -0.7182733 -0.3333229 -0.1537601 debye
polarizability: 146.4497543|16.6493923|187.9580507|3.7659203|10.7866971|126.0592264 unknown
InChI: InChI=1S/C10H15IN2O3/c1-2-3-4-10(5-6-11)7(14)12-9(16)13-8(10)15/h12-13H,2-6H2,1H3
charge 0 multiplicity 1
31 atoms
I  2.647102 4.308164 0.656477
O  -0.027633 -0.490892 2.497112
O  0.517318 0.701764 -2.194584
O  1.839471 -3.440985 -0.568245
N  0.8993 -1.920579 0.93917
N  1.200763 -1.323535 -1.326724
C  0.240344 0.410152 0.229068
C  -1.232461 0.938577 0.197396
C  1.24658 1.547224 0.702973
C  -2.288945 -0.147285 -0.106114
C  0.342991 -0.683517 1.311063
C  0.643658 -0.039932 -1.183965
C  -3.718567 0.439109 -0.163743
C  1.159739 2.844205 -0.108942
C  1.350319 -2.309932 -0.33449
C  -4.79243 -0.634413 -0.44058
H  -1.293834 1.727099 -0.574091
H  -1.443519 1.397538 1.181551
H  2.280204 1.152894 0.663199
H  1.011952 1.746724 1.764115
H  -2.063969 -0.636837 -1.07649
H  -2.256518 -0.936225 0.67228
H  -3.760561 1.21954 -0.950267
H  -3.940698 0.948029 0.796061
H  0.197111 3.361828 0.001409
H  1.407557 2.717118 -1.170672
H  0.989207 -2.628553 1.675991
H  1.504488 -1.594372 -2.268436
H  -4.792624 -1.408196 0.349855
H  -4.609439 -1.140388 -1.407252
H  -5.803805 -0.19072 -0.478727
