program: Gaussian 09
title: 000257297
version: EM64L-G09RevD.01
frameworkgroup: C1[X(C13H20N2O4S2)]
method: RPBEPBE
basis: SDD
operation: Freq
keyword: #p
keyword: freq=noraman
keyword: PBEPBE/SDD
title: #p freq=noraman PBEPBE/SDD
converged: YES YES NO NO
title: Mulliken charges:
elementType: S S O O O O N N C C C C C C C C C C C C C H H H H H H H H H H H H H H H H H H H H
charge: 0.202909 0.073867 -0.202713 -0.222492 -0.216861 -0.151796 -0.371794 -0.375765 0.111102 -0.486430 -0.376461 -0.376352 -0.027477 0.142820 0.154835 -0.759705 -0.718880 -0.714208 0.153471 -0.344322 -0.516028 0.236438 0.261484 0.207988 0.197943 0.230593 0.287588 0.198589 0.322701 0.309073 0.213140 0.216810 0.207654 0.211984 0.209263 0.228321 0.368765 0.367276 0.252945 0.246485 0.247242
chargesum: 0.00000
title: Mulliken charges with hydrogens summed into heavy atoms:
elementType: S S O O O O N N C C C C C C C C C C C C C
charge: 0.202909 0.073867 -0.202713 -0.222492 -0.216861 -0.151796 -0.003030 -0.008490 0.111102 0.011492 0.029470 0.141829 0.171111 0.142820 0.154835 -0.127931 -0.081276 -0.064640 0.153471 -0.344322 0.230644
polarizability: 2.40757128e+02 1.03359376e+01 2.10396235e+02 1.08964394e+00 1.40842375e+01 1.61332558e+02
1716.lowfreq: -7.2200 -0.0023 -0.0011 -0.0005 5.6094 8.0272 13.9469 19.9177 29.8051
frequency: 13.8120 19.7037 29.7030 34.2259 39.6240 52.8793 61.1674 104.4448 112.8098 124.8097 127.5815 134.5007 158.3284 162.6215 183.4226 192.1267 197.9778 221.5138 229.5501 245.1653 261.0009 273.9558 299.1400 338.2609 357.4336 358.4274 370.1502 391.5060 421.2810 446.7040 454.9070 480.1571 490.6077 502.8617 506.9341 594.8253 628.1718 657.4436 681.2971 698.4165 728.8645 738.8141 753.3174 755.7870 774.2714 794.0182 822.7966 859.2064 887.2754 916.8539 942.5487 949.8626 965.1441 972.7603 978.9877 996.3486 1028.7337 1050.6751 1071.9605 1088.0924 1092.7850 1135.2524 1144.1562 1149.9517 1176.0387 1178.0795 1199.0796 1209.0787 1245.8754 1266.9289 1272.8575 1299.5824 1302.0211 1319.8655 1333.1276 1336.8374 1348.5866 1357.0461 1366.8174 1376.7922 1378.1413 1380.3055 1397.0606 1427.4040 1431.0028 1446.1409 1455.9950 1458.3329 1461.9462 1464.1176 1469.0035 1472.0911 1481.8574 1488.7438 1609.8069 1647.1238 1678.5939 2951.1985 2960.4422 2967.0006 2973.6397 2991.4886 2993.6610 3008.7428 3014.0484 3035.8031 3059.6779 3062.6437 3066.3896 3071.3151 3075.0847 3084.5125 3098.3492 3122.9068 3150.2951 3515.6137 3517.5799
redmass: 9.1964 6.6710 5.1108 4.7631 3.1398 4.2935 5.9770 7.2153 2.2164 3.2040 3.7618 6.4871 4.9343 6.0963 1.4034 2.7815 1.1110 2.0068 1.5005 2.0483 3.0054 4.9589 3.9761 5.0179 8.8500 4.5683 3.9554 4.2403 2.9961 3.2904 4.1428 9.7164 9.2170 11.7603 5.3750 9.0826 4.2406 2.5573 2.7670 5.9198 4.8929 1.8410 1.4658 1.6762 1.9468 1.6999 2.6262 8.5282 1.9972 1.1822 2.0119 1.4613 2.9082 2.8139 3.9686 3.2739 2.3846 2.4964 3.5630 3.2336 1.2483 2.1340 1.4392 2.1337 3.1166 2.3493 2.4867 1.6687 1.5944 1.3164 1.2304 2.0123 1.3251 1.2726 1.4701 1.3907 1.3590 1.4908 7.5084 1.7414 1.6695 1.2606 1.2121 1.1706 1.0863 1.0790 1.0484 1.0501 1.0859 1.0902 1.0493 1.0610 1.0550 1.0493 6.6580 8.4717 5.4878 1.0589 1.0830 1.0357 1.0365 1.0605 1.0300 1.0972 1.0632 1.0592 1.0994 1.1020 1.0995 1.0989 1.0991 1.1031 1.1054 1.1050 1.1031 1.0759 1.0780
irintensity: 0.2190 2.1553 2.5970 0.1224 0.2753 0.0378 1.5723 0.0981 0.0292 6.5225 3.4200 0.1580 6.1440 5.5573 1.3186 1.5402 0.2511 2.5006 1.4195 1.2360 4.1523 1.8065 6.2877 6.1628 18.6376 16.1001 4.8888 0.2330 6.3755 4.6769 11.2940 15.4816 6.2516 3.1888 30.2202 0.0830 5.5270 0.5845 43.4272 8.2748 3.8894 10.0625 3.4363 4.1209 4.6406 222.5447 1.5569 88.5323 4.5443 3.6561 2.6660 4.9712 79.7243 80.4120 6.5615 3.4595 0.4129 6.6874 2.3052 22.7148 0.0962 2.7625 23.8035 5.0638 266.4228 79.2803 64.8202 10.2035 27.1055 43.6653 24.5527 213.6992 64.7821 14.6986 32.1386 23.7135 32.8310 26.7807 201.6879 6.5871 7.6487 9.7275 14.6869 19.4225 10.6241 17.4575 43.6087 21.8758 7.3702 8.8568 2.2215 6.2711 7.2008 22.5807 268.2419 72.7314 642.6934 25.0089 17.5688 40.3768 21.3033 11.7654 20.5577 20.8935 18.2924 4.8241 21.7203 3.3641 26.7340 70.0787 63.3931 10.4873 20.3452 2.9878 17.1136 83.9269 51.1917
temp: 298.150 k
press: 1.00000 atm
elementType: 16 16 8 8 8 8 7 7 6 6 6 6 6 6 6 6 6 6 6 6 6 1 1 1 1 1 1 1 1 1 1 1 1 1 1 1 1 1 1 1 1
symmnumber: 1
zpe: 847641.5 jmol-1
zpe.correction: 0.322850 hartree
zpe.thermalcorrener: 0.346754 hartree
zpe.thermalcorrenthalpy: 0.347698 hartree
zpe.thermalcorrgfe: 0.265749 hartree
zpe.sumelectzpe: -1712.314395 hartree
zpe.sumelectthermal: -1712.290490 hartree
zpe.sumelectthermalent: -1712.289546 hartree
zpe.sumelectthermalfe: -1712.371496 hartree
dipole: 1.2014 -2.2807 -1.4288
dipole: 2.9472
quadrupole: -127.4854 -148.0117 -149.8603
quadrupole: -22.0571 -3.2701 -3.2705
quadrupole: 14.3004 -6.2259 -8.0745 -22.0571 -3.2701 -3.2705
hfenergy: -1712.6372445 hartree
pointgroup: C01 [X(C13H20N2O4S2)]
dipole: -0.6511798 0.8805719 -0.3808961 debye
polarizability: 235.8412316|11.0614964|214.7342786|-13.5164292|-12.5410291|161.9104107 unknown
InChI: InChI=1S/C13H20N2O4S2/c1-8(2)4-5-13(6-7-21-12(20)19-3)9(16)14-11(18)15-10(13)17/h8,14-15H,4-7H2,1-3H3
charge 0 multiplicity 1
41 atoms
S  -3.676999 0.162829 0.12859
S  -2.92216 -2.692566 1.240741
O  1.387616 -0.210887 2.469778
O  0.402917 0.928745 -2.164909
O  3.072998 3.639698 0.492091
O  -5.228754 -1.456187 1.667124
N  2.192013 1.695148 1.447474
N  1.685821 2.259782 -0.78778
C  0.621458 0.184181 0.168692
C  0.938471 -1.289102 -0.251767
C  2.433273 -1.548239 -0.543399
C  -0.898326 0.331305 0.596091
C  2.718977 -2.975592 -1.085801
C  1.424158 0.514508 1.443897
C  0.889429 1.123142 -1.018475
C  -1.909624 -0.122691 -0.469473
C  4.204141 -3.100484 -1.500116
C  2.345004 -4.073851 -0.06055
C  2.366632 2.606849 0.393378
C  -3.987026 -1.401163 1.076083
C  -6.205336 -0.342421 1.531255
H  0.349742 -1.517334 -1.158544
H  0.581275 -1.941562 0.564023
H  3.032102 -1.395821 0.378671
H  2.796602 -0.814293 -1.293431
H  -1.09692 1.385636 0.871594
H  -1.023845 -0.285347 1.504788
H  2.094313 -3.121907 -1.993194
H  -1.830972 0.444349 -1.409325
H  -1.836477 -1.203093 -0.674383
H  4.47713 -2.343502 -2.259434
H  4.416441 -4.099299 -1.923942
H  4.867782 -2.958229 -0.62501
H  2.596469 -5.07633 -0.453582
H  2.90341 -3.930879 0.884907
H  1.266704 -4.072274 0.179782
H  2.691393 1.918297 2.315141
H  1.820556 2.897969 -1.579442
H  -7.080037 -0.684512 2.100584
H  -5.794301 0.585196 1.966538
H  -6.466951 -0.186663 0.470036
