program: Gaussian 09
title: 000257296
version: EM64L-G09RevD.01
frameworkgroup: C1[X(C9H15N3O3)]
method: RPBEPBE
basis: SDD
operation: Freq
keyword: #p
keyword: freq=noraman
keyword: PBEPBE/SDD
title: #p freq=noraman PBEPBE/SDD
converged: YES YES NO NO
title: Mulliken charges:
elementType: O O O N N N C C C C C C C C C H H H H H H H H H H H H H H H
charge: -0.213006 -0.213501 -0.221224 -0.368904 -0.378229 -0.295105 0.101829 -0.447355 -0.398980 0.135868 0.157589 -0.384095 -0.705241 0.151523 -0.628140 0.218503 0.261751 0.249585 0.214501 0.229426 0.193678 0.231250 0.253606 0.219733 0.367048 0.365463 0.256313 0.223806 0.229600 0.192707
chargesum: 0.00000
title: Mulliken charges with hydrogens summed into heavy atoms:
elementType: O O O N N N C C C C C C C C C
charge: -0.213006 -0.213501 -0.221224 -0.001856 -0.012766 -0.038792 0.101829 0.032899 0.065106 0.135868 0.157589 0.039008 -0.000652 0.151523 0.017974
polarizability: 1.49553882e+02 1.45517824e+01 1.23348905e+02 3.96552069e+00 -1.54117120e+00 1.17073688e+02
1716.lowfreq: -9.5802 -5.8973 0.0001 0.0003 0.0007 6.5990 26.0675 48.5468 68.2472
frequency: 26.0101 48.5010 68.2157 79.5313 104.9816 131.5468 139.9095 155.1048 172.7999 196.1160 215.4175 245.2325 256.9324 282.7685 305.9451 356.8326 371.3792 391.4413 438.5003 483.1281 497.1886 592.2481 628.1304 652.5509 661.8443 672.5145 700.8682 750.0189 756.5003 769.2056 786.7587 793.2951 913.2918 918.2815 969.5325 990.1302 1006.7135 1035.7324 1055.3514 1081.2530 1095.1739 1120.8453 1146.2099 1159.8664 1174.5935 1208.2097 1240.7513 1277.7314 1292.2426 1301.1663 1319.0644 1332.7011 1364.7197 1373.7775 1375.0073 1376.9703 1402.7862 1436.0777 1444.2480 1454.3514 1466.3450 1467.9323 1473.6664 1487.0179 1489.6923 1496.7937 1612.7304 1647.8527 1676.6791 2831.1453 2878.9926 2979.9439 2995.6447 3008.6450 3016.9097 3019.4888 3042.4772 3078.2200 3084.8131 3101.3295 3104.5353 3450.7571 3518.5196 3520.6930
redmass: 7.3768 4.0417 2.0809 2.3552 2.1741 3.0209 5.0501 9.7571 3.3889 2.3974 1.7554 1.4675 1.7690 2.8006 3.5276 11.2456 10.6054 3.1817 4.1278 8.9860 4.3254 8.1840 3.8858 2.2028 1.4576 2.2809 6.3762 2.9168 2.0314 1.3633 1.6373 1.3531 2.8561 2.1062 2.2005 3.4100 2.0494 2.3840 2.1427 2.2706 1.5742 1.7696 2.6072 3.3370 3.0239 2.9274 1.4099 1.2752 1.5472 1.6624 1.4437 1.5764 8.3761 1.7605 1.5301 1.5416 1.2014 1.1487 1.0960 1.1865 1.0834 1.0705 1.0430 1.0709 1.0521 1.0574 6.8109 8.5088 5.5064 1.0711 1.0557 1.0598 1.0371 1.0773 1.0750 1.0728 1.1015 1.0996 1.0988 1.1001 1.0998 1.0746 1.0760 1.0779
irintensity: 0.5345 0.7527 1.4460 1.8557 2.3018 0.5510 0.4896 11.5278 0.8940 0.0845 1.1365 0.2094 0.9211 3.2855 5.7752 25.2275 13.9703 10.1451 23.4492 16.7298 16.8787 0.3602 5.9335 27.8510 71.8196 33.1012 4.2402 11.9293 4.0359 7.5931 230.8142 5.5965 8.4649 0.6247 3.3700 0.8351 9.8661 9.8845 8.2352 9.4682 22.3537 3.3468 34.3417 32.8343 32.8710 34.6301 13.6424 35.8004 49.7522 156.7623 51.8478 65.0768 216.0635 2.9618 9.4428 17.9254 23.8177 2.2347 16.0020 17.7751 5.5635 13.4160 9.5499 18.2626 11.5142 6.5190 303.6786 66.9855 627.2208 117.0305 153.5525 21.5748 21.8581 7.5230 50.7281 20.5144 8.0789 37.5561 26.5008 17.5229 15.0164 0.5970 80.7750 47.9531
temp: 298.150 k
press: 1.00000 atm
elementType: 8 8 8 7 7 7 6 6 6 6 6 6 6 6 6 1 1 1 1 1 1 1 1 1 1 1 1 1 1 1
symmnumber: 1
zpe: 640295.3 jmol-1
zpe.correction: 0.243876 hartree
zpe.thermalcorrener: 0.259824 hartree
zpe.thermalcorrenthalpy: 0.260768 hartree
zpe.thermalcorrgfe: 0.199796 hartree
zpe.sumelectzpe: -740.756500 hartree
zpe.sumelectthermal: -740.740552 hartree
zpe.sumelectthermalent: -740.739608 hartree
zpe.sumelectthermalfe: -740.800579 hartree
dipole: 0.3028 0.4802 0.8383
dipole: 1.0124
quadrupole: -93.1273 -90.2627 -96.8303
quadrupole: -10.4691 0.2993 3.5609
quadrupole: 0.2794 3.1440 -3.4235 -10.4691 0.2993 3.5609
hfenergy: -741.0003754 hartree
pointgroup: C01 [X(C9H15N3O3)]
dipole: -0.1308898 0.1259461 -0.354491 debye
polarizability: 150.7095776|-12.731591|122.7778534|5.6590652|0.8837348|116.4890443 unknown
InChI: InChI=1S/C9H15N3O3/c1-3-9(4-5-10-2)6(13)11-8(15)12-7(9)14/h10-12H,3-5H2,1-2H3
charge 0 multiplicity 1
30 atoms
O  0.039936 -0.95956 -2.324871
O  0.196378 1.372225 1.919168
O  3.347321 -1.854557 0.815022
N  1.684711 -1.350037 -0.750544
N  1.797575 -0.167495 1.289823
N  -3.560888 -0.475689 0.076353
C  0.120123 0.594452 -0.41703
C  -1.431656 0.670556 -0.41324
C  0.746201 1.833924 -1.197386
C  0.570557 -0.634031 -1.23119
C  0.665325 0.630561 1.017668
C  -2.107381 -0.51487 0.308036
C  0.343294 3.224567 -0.669932
C  2.352981 -1.168047 0.473142
C  -4.351569 -1.424898 0.880733
H  -1.759504 0.696781 -1.469859
H  -1.754392 1.6035 0.07481
H  0.426265 1.721143 -2.250708
H  1.850301 1.735395 -1.182747
H  -1.936516 -0.429121 1.398648
H  -1.641201 -1.480628 -0.022001
H  -0.733253 3.419715 -0.810994
H  0.570285 3.344339 0.402841
H  0.899288 3.999087 -1.229127
H  2.04036 -2.108485 -1.341939
H  2.223382 -0.065639 2.217212
H  -3.784766 -0.530956 -0.926025
H  -5.421672 -1.323103 0.627978
H  -4.238039 -1.181262 1.953319
H  -4.063847 -2.496466 0.746742
