program: Gaussian 09
title: 000257291
version: EM64L-G09RevD.01
frameworkgroup: C1[X(C8H10ClN3O4)]
method: RPBEPBE
basis: SDD
operation: Freq
keyword: #p
keyword: freq=noraman
keyword: PBEPBE/SDD
title: #p freq=noraman PBEPBE/SDD
converged: YES YES NO NO
title: Mulliken charges:
elementType: Cl O O O O N N N C C C C C C C C H H H H H H H H H H
charge: -0.063107 -0.203717 -0.198524 -0.219193 -0.265295 -0.423321 -0.367864 -0.361405 0.161056 -0.464467 0.188210 0.184062 -0.686886 0.175791 0.359880 -0.690197 0.262927 0.231915 0.334739 0.211320 0.261437 0.230893 0.368785 0.370691 0.301284 0.300985
chargesum: 0.00000
title: Mulliken charges with hydrogens summed into heavy atoms:
elementType: Cl O O O O N N N C C C C C C C C
charge: -0.063107 -0.203717 -0.198524 -0.219193 -0.265295 -0.088582 0.000921 0.009286 0.161056 0.030374 0.188210 0.184062 0.016765 0.175791 0.359880 -0.087928
polarizability: 1.60091122e+02 1.51838681e+01 1.14948185e+02 6.30353482e+00 -3.26700295e-01 1.06066152e+02
1716.lowfreq: -9.8595 -0.0015 0.0006 0.0018 3.1035 4.5876 33.4319 37.6895 70.7084
frequency: 33.3250 37.6241 70.7070 83.9192 91.8959 114.1784 139.5491 149.3404 161.9457 177.2184 201.5982 258.3025 298.4072 326.3811 335.6028 364.6716 380.1361 396.1399 469.9177 486.0034 562.1204 569.2916 581.8726 610.6534 639.6075 654.9993 666.6791 694.8300 698.6167 751.6805 773.5897 787.2809 810.0627 909.7227 913.7261 949.2510 987.6257 994.5906 1033.3627 1087.2136 1119.0029 1155.4444 1184.7258 1214.1697 1257.7542 1259.2453 1285.2062 1325.4008 1336.2785 1361.4246 1379.5262 1382.3128 1409.2711 1418.6585 1464.9206 1475.3181 1482.8208 1501.7681 1587.6347 1625.7624 1663.0811 1679.5751 2994.3534 2996.3995 3051.7123 3071.3826 3082.8659 3106.5852 3152.6336 3518.2261 3520.7648 3532.1220
redmass: 8.9686 11.5830 5.3619 3.7070 3.4953 2.3525 12.9257 5.0080 8.3731 5.3514 1.9672 1.7396 4.4675 5.3054 7.0792 9.0114 12.7280 7.8142 5.1694 6.4583 6.2340 2.8521 1.3183 6.8702 2.8445 4.4465 2.2956 6.3817 6.2999 1.6912 1.6551 1.7456 2.7416 4.0466 1.7446 2.3602 4.2963 4.2232 1.9717 3.4657 2.4623 1.1212 3.2761 5.3589 1.9484 1.2200 1.6051 1.8622 1.8116 9.8732 1.9427 1.5318 1.2042 1.0963 1.1191 1.1479 1.0594 1.7931 9.0074 7.2510 10.1851 5.1784 1.0409 1.0564 1.1020 1.0566 1.0992 1.1001 1.1090 1.0759 1.0778 1.0788
irintensity: 0.2515 0.5917 0.1109 0.0338 17.0215 0.2624 1.6377 0.0438 8.8293 6.0006 0.5396 2.9127 5.1456 23.5312 34.0977 17.5889 1.1135 12.2717 21.3688 17.9366 15.8862 24.1247 29.6918 5.3622 0.7180 2.4600 23.3657 58.3376 18.3501 8.1993 12.2637 217.8724 2.1597 0.5054 6.0338 8.2068 0.9648 1.9587 16.6478 0.0674 9.1270 0.0246 50.9242 41.5189 33.0042 18.7741 100.4984 66.9314 84.5887 274.4986 1.7699 1.4307 27.0672 41.4627 38.0319 24.4823 23.6193 250.6997 144.6623 323.7047 41.3930 650.8318 22.0338 7.1751 3.7613 2.1346 38.5252 14.6618 0.0551 87.2257 52.8194 62.7221
temp: 298.150 k
press: 1.00000 atm
elementType: 17 8 8 8 8 7 7 7 6 6 6 6 6 6 6 6 1 1 1 1 1 1 1 1 1 1
symmnumber: 1
zpe: 495553.0 jmol-1
zpe.correction: 0.188746 hartree
zpe.thermalcorrener: 0.204680 hartree
zpe.thermalcorrenthalpy: 0.205625 hartree
zpe.thermalcorrgfe: 0.144151 hartree
zpe.sumelectzpe: -1234.923524 hartree
zpe.sumelectthermal: -1234.907590 hartree
zpe.sumelectthermalent: -1234.906646 hartree
zpe.sumelectthermalfe: -1234.968120 hartree
dipole: 0.6403 2.6976 1.0983
dipole: 2.9821
quadrupole: -107.9463 -97.2704 -105.7325
quadrupole: -7.5939 -3.4778 4.3076
quadrupole: -4.2965 6.3793 -2.0827 -7.5939 -3.4778 4.3076
hfenergy: -1235.1122702 hartree
pointgroup: C01 [X(C8H10Cl1N3O4)]
dipole: -0.0305445 -1.1507847 0.2264863 debye
dipolederiv: -0.4947814 -0.0943066 0.0693892 -0.2778259 -0.3585895 0.0867819 0.1111953 0.0624105 -0.1702551 -0.6565585 -0.2261128 -0.1741556 -0.1736303 -0.4640718 -0.1110467 -0.2524051 -0.2185447 -0.8199693 -0.5537912 -0.0945244 0.1644294 -0.0553605 -0.3975297 -0.1052319 0.2036464 -0.0394442 -1.0103074 -1.0891806 -0.3968158 0.1629539 -0.4238924 -0.5984794 0.0539124 0.1751589 0.0543265 -0.6052656 -0.8768673 -0.2366098 0.1257891 0.1716152 -0.8135643 0.0852766 0.019304 0.1464987 -0.3724788 -0.718755 0.2991976 -0.0167979 0.3808461 -0.8397871 0.0598491 -0.0388589 0.0821962 -0.3587322 -1.1633797 -0.529114 -0.3324569 -0.4939268 -0.6376384 -0.2962551 -0.1107047 -0.1618522 -0.5598362 -0.9794334 -0.2267044 0.5996222 -0.2854366 -0.3902431 0.2482245 0.3913611 0.103359 -0.9936335 0.5041842 -0.1864333 -0.0539745 -0.1545646 -0.1102088 -0.0277157 -0.0587284 -0.0035791 -0.1032978 0.0495348 -0.130996 0.0071784 0.017073 0.2883901 -0.0443478 -0.0242521 -0.0535355 0.0109554 1.2246793 0.6630877 0.2061523 0.442365 0.5455269 0.1489728 -0.066077 -0.0080637 0.9289618 1.1196004 0.4658206 -0.4922205 0.3938475 0.5372866 -0.0170233 -0.1597143 0.1489077 1.1225401 0.0772487 0.0074177 -0.0201729 -0.0221014 -0.1105847 -0.041846 -0.0441797 0.0149597 0.0128941 1.551332 0.7147502 -0.1688807 0.6930135 0.7878721 0.1661603 -0.1717382 0.1642922 1.6525609 1.0705546 -0.0130297 -0.1147355 -0.5246451 1.1381003 -0.1496701 0.021323 -0.2320372 0.2433319 0.1887611 0.2505929 -0.0680408 0.521485 0.4375932 -0.1382973 -0.1286632 -0.1024376 0.182326 0.0912222 -0.0236677 0.0312447 0.0013208 0.0208307 -0.0010662 0.0217537 0.009372 -0.0775067 -0.1292326 -0.0050446 0.0005905 -0.0185181 0.0386579 -0.0068058 0.0278247 -0.0226808 0.0858822 0.3151051 -0.0224415 -0.0154508 -0.0138764 0.2116783 0.0283277 -0.0323769 0.0391203 0.2585896 -0.1594909 -0.0244021 0.0352392 0.0125703 0.0989876 -0.0264583 0.0596628 -0.0244135 0.0650012 0.0791569 -0.0236268 0.0302786 -0.0082326 0.1441101 0.0462552 0.0216788 -0.0120027 -0.0732193 0.0490721 0.0822633 -0.0360434 0.0594028 -0.137005 0.0353981 -0.0281088 0.0518506 0.0873695 0.1918497 -0.0845055 -0.0268531 -0.0920073 0.2826576 -0.0069786 -0.0386391 -0.030029 0.2296203 0.2206737 -0.0573483 0.0609188 -0.0614642 0.2939983 -0.0083631 0.0817593 0.0078059 0.1957892 0.0507582 -0.057297 0.0208816 -0.0363702 -0.0073374 -0.0359723 0.0646137 -0.0348105 0.0502918 0.0377373 -0.0501494 0.0051146 -0.0516866 0.0393495 0.0579196 -0.0448353 0.0583312 0.0183878 unknown
polarizability: 151.4399176|22.5102902|120.8538221|-10.738012|-2.1612598|108.8117197 unknown
InChI: InChI=1S/C8H10ClN3O4/c1-2-8(12-4(13)3-9)5(14)10-7(16)11-6(8)15/h10-12H,2-3H2,1H3
charge 0 multiplicity 1
26 atoms
Cl -4.290308 -0.752407 0.898328
O  -0.142198 -0.808298 -2.102476
O  0.449141 0.370626 2.555227
O  3.594923 1.540316 -0.661288
O  -1.184562 1.693128 -0.07032
N  -1.300721 -0.544927 0.495446
N  1.764747 0.248882 -1.327016
N  2.031205 0.870649 0.940286
C  0.145584 -0.684842 0.347476
C  0.585798 -2.147096 0.726703
C  0.536457 -0.401581 -1.129143
C  0.848622 0.254435 1.372873
C  -0.096499 -3.27316 -0.077502
C  2.538948 0.928659 -0.369397
C  -1.872763 0.675422 0.263119
C  -3.37989 0.831213 0.409054
H  0.381275 -2.265036 1.808107
H  1.682796 -2.211704 0.59881
H  -1.883364 -1.344222 0.75359
H  -1.181899 -3.33724 0.120211
H  0.035022 -3.144268 -1.164251
H  0.343836 -4.242841 0.215359
H  2.077137 0.356362 -2.297865
H  2.546556 1.420579 1.635581
H  -3.602813 1.568552 1.193793
H  -3.813534 1.150499 -0.549705
