program: Gaussian 09
title: 000257290
version: EM64L-G09RevD.01
frameworkgroup: C1[X(C8H12N4O4)]
method: RPBEPBE
basis: SDD
operation: Freq
keyword: #p
keyword: freq=noraman
keyword: PBEPBE/SDD
title: #p freq=noraman PBEPBE/SDD
converged: YES YES NO NO
title: Mulliken charges:
elementType: O O O O N N N N C C C C C C C C H H H H H H H H H H H H
charge: -0.210169 -0.208438 -0.281548 -0.226287 -0.423292 -0.367384 -0.360058 -0.629234 0.173917 -0.459208 0.187818 0.181008 -0.689762 0.278579 0.173840 -0.509717 0.256710 0.227318 0.362580 0.212379 0.259790 0.224002 0.365062 0.366627 0.252707 0.246246 0.299164 0.297353
chargesum: 0.00000
title: Mulliken charges with hydrogens summed into heavy atoms:
elementType: O O O O N N N N C C C C C C C C
charge: -0.210169 -0.208438 -0.281548 -0.226287 -0.060712 -0.002322 0.006569 -0.032717 0.173917 0.024819 0.187818 0.181008 0.006408 0.278579 0.173840 -0.010765
polarizability: 1.54383406e+02 1.02699954e+01 1.13720071e+02 3.48189999e+00 -2.43008594e+00 1.09924655e+02
1716.lowfreq: -11.4642 -0.0009 -0.0006 -0.0004 3.7338 9.2114 36.8727 39.0935 68.1461
frequency: 36.8461 38.9800 68.1355 86.0139 102.4021 112.7623 148.5790 154.6486 175.7220 182.1872 205.1415 250.9430 262.1473 298.4305 344.1971 348.6261 366.4051 395.8473 462.5430 480.8946 511.7394 556.1952 585.4013 615.9145 637.5940 653.4038 665.9356 697.1378 698.1457 748.8723 752.4014 774.4874 785.9326 809.9629 888.4814 917.1446 948.2890 986.4989 994.9662 1034.6356 1077.5809 1091.4339 1118.4736 1143.2113 1186.8734 1211.6791 1213.6041 1285.2217 1291.2341 1322.2295 1334.0445 1340.9847 1366.3582 1377.8857 1380.4493 1407.3416 1442.7179 1462.3134 1471.4583 1482.8680 1486.2545 1604.4323 1622.9257 1647.6723 1659.7269 1677.7059 2986.7155 2992.3260 2995.5925 3048.6863 3056.3452 3082.9773 3105.5085 3428.8879 3482.0794 3519.3770 3521.7090 3605.1591
redmass: 3.7611 8.9789 5.9471 3.1006 2.0475 2.5856 4.9241 6.3169 4.1440 4.7541 2.3982 1.4692 1.4941 4.2791 7.4293 7.0327 8.4785 7.2312 4.6024 8.7839 5.1647 3.8786 5.0338 3.8003 2.7878 4.6626 2.1922 2.2216 2.7582 1.5217 1.2187 1.5329 1.7508 2.7472 2.5525 1.9711 2.3008 5.1294 3.6611 1.9714 3.3810 3.1199 2.3487 1.3083 2.8550 3.0077 2.8733 1.6230 1.2095 2.1326 1.5885 1.3729 9.9028 2.0971 1.4570 1.2156 1.2086 1.2504 1.2055 1.1778 1.2185 9.0715 7.1237 1.0996 9.9051 5.1148 1.0628 1.0546 1.0420 1.1021 1.0993 1.0993 1.0998 1.0779 1.0464 1.0758 1.0778 1.0983
irintensity: 6.3642 1.8907 0.1618 1.0592 5.1500 0.9374 0.1594 5.3427 3.6065 7.4736 0.3198 4.8638 10.7078 6.3778 19.2507 42.0877 14.3518 10.9642 28.3605 13.7557 8.3788 3.7742 2.4748 6.4448 2.3746 0.4203 56.9371 95.0658 106.3144 33.2709 34.0440 7.9551 203.9425 11.9935 5.8943 4.7812 8.9819 1.1520 4.5362 17.2694 22.0953 2.0612 8.0306 0.2927 41.0797 31.1037 19.9349 107.7341 8.9054 119.0472 63.0627 12.4621 273.1670 1.9057 2.0596 25.3145 135.3499 53.8653 20.2904 99.6712 57.3549 188.9855 329.4112 52.5206 28.4879 644.7718 27.4091 18.4603 17.2917 5.4506 8.1075 39.0906 17.6639 147.5808 0.4250 83.4699 45.9749 8.6454
temp: 298.150 k
press: 1.00000 atm
elementType: 8 8 8 8 7 7 7 7 6 6 6 6 6 6 6 6 1 1 1 1 1 1 1 1 1 1 1 1
symmnumber: 1
zpe: 564138.8 jmol-1
zpe.correction: 0.214869 hartree
zpe.thermalcorrener: 0.231016 hartree
zpe.thermalcorrenthalpy: 0.231960 hartree
zpe.thermalcorrgfe: 0.170756 hartree
zpe.sumelectzpe: -830.799875 hartree
zpe.sumelectthermal: -830.783728 hartree
zpe.sumelectthermalent: -830.782784 hartree
zpe.sumelectthermalfe: -830.843988 hartree
dipole: 4.3897 2.9843 1.7018
dipole: 5.5742
quadrupole: -80.0893 -95.7168 -99.5178
quadrupole: -6.1981 -1.4089 2.2767
quadrupole: 11.6853 -3.9421 -7.7432 -6.1981 -1.4089 2.2767
hfenergy: -831.0147439 hartree
pointgroup: C01 [X(C8H12N4O4)]
dipole: -1.4682519 1.2563163 -1.0370557 debye
polarizability: 149.2703498|-15.0055918|118.5087735|9.0712268|-0.7756704|110.2490087 unknown
InChI: InChI=1S/C8H12N4O4/c1-2-8(12-4(13)3-9)5(14)10-7(16)11-6(8)15/h10-12H,2-3,9H2,1H3
charge 0 multiplicity 1
28 atoms
O  0.307173 1.629954 1.855621
O  0.075136 -1.359781 -1.957147
O  -1.115592 -1.396315 1.261967
O  3.674798 -1.441184 0.979523
N  -1.298967 0.406447 -0.18206
N  2.01541 0.169723 1.314018
N  1.886219 -1.317162 -0.518259
N  -3.965748 0.347093 -0.31782
C  0.144316 0.496604 -0.334587
C  0.515244 1.649474 -1.338603
C  0.786115 0.797611 1.047982
C  0.661048 -0.821197 -0.987293
C  -0.029131 3.045023 -0.971557
C  -1.835364 -0.561138 0.625595
C  2.60051 -0.900454 0.617611
C  -3.368359 -0.532555 0.710596
H  0.132265 1.334733 -2.32832
H  1.618344 1.689028 -1.419182
H  -1.976875 1.020843 -0.653905
H  -1.133361 3.07687 -0.97778
H  0.304591 3.369205 0.027717
H  0.327251 3.780274 -1.715378
H  2.481876 0.429794 2.189276
H  2.26515 -2.140303 -0.997817
H  -3.6240 -0.153375 1.717145
H  -3.718534 -1.583144 0.670298
H  -4.734913 0.933329 0.013786
H  -4.197004 -0.128593 -1.194828
