program: Gaussian 09
title: 000257285
version: EM64L-G09RevD.01
frameworkgroup: C1[X(C9H14N4O4)]
method: RPBEPBE
basis: SDD
operation: Freq
keyword: #p
keyword: freq=noraman
keyword: PBEPBE/SDD
title: #p freq=noraman PBEPBE/SDD
converged: YES YES NO NO
title: Mulliken charges:
elementType: O O O O N N N N C C C C C C C C C H H H H H H H H H H H H H H
charge: -0.215660 -0.223468 -0.217847 -0.271474 -0.339029 -0.371562 -0.362880 -0.520147 0.104394 -0.391718 -0.465266 0.145240 0.186290 -0.710920 0.161399 0.240112 -0.526346 0.220066 0.225876 0.272036 0.271769 0.235079 0.231261 0.224363 0.309444 0.368428 0.369398 0.225879 0.260369 0.288514 0.276399
chargesum: 0.00000
title: Mulliken charges with hydrogens summed into heavy atoms:
elementType: O O O O N N N N C C C C C C C C C
charge: -0.215660 -0.223468 -0.217847 -0.271474 -0.029585 -0.003134 0.006518 0.044766 0.104394 0.054224 0.078539 0.145240 0.186290 -0.020217 0.161399 0.240112 -0.040098
polarizability: 1.52115109e+02 -4.91322577e+00 1.49473699e+02 1.28907695e+01 5.12935498e+00 1.07393844e+02
1716.lowfreq: 0.0004 0.0007 0.0008 3.8673 5.5249 11.0078 27.9170 33.7406 40.8391
frequency: 27.8591 33.6954 40.7952 58.4040 64.3878 98.3971 139.1775 143.7739 153.8690 172.0306 188.0402 208.4566 217.2273 245.9865 278.3969 299.4649 334.8796 359.4092 365.4647 434.7759 450.5546 481.5093 496.3986 542.8591 568.0284 590.8287 629.0932 641.9812 660.6819 676.3116 705.9572 716.2352 730.6118 754.1557 771.8408 784.2159 832.6589 894.2897 925.7896 926.9056 975.1177 990.3880 1017.4012 1064.0283 1088.6310 1142.3318 1145.4390 1150.6047 1158.8926 1202.1760 1211.9062 1262.4414 1303.8829 1313.8986 1319.7391 1339.6130 1341.9479 1358.9190 1365.3721 1376.2762 1379.6132 1397.0519 1441.1572 1444.2929 1449.5660 1480.2509 1482.1885 1485.8190 1612.1660 1626.2916 1648.6289 1661.9230 1679.5229 2979.2804 2987.2040 3007.3146 3014.6296 3035.6252 3062.8990 3084.4270 3085.8540 3091.2151 3453.9401 3519.6120 3524.8464 3550.3728 3570.3639
redmass: 2.9883 4.1905 5.4424 3.1913 7.1487 2.5168 4.3127 6.4185 5.6173 7.0048 3.1740 1.3286 1.4936 3.0952 3.1589 2.0158 3.0440 11.3959 8.8309 5.0177 3.2415 7.1199 3.1471 2.4407 1.6651 7.9134 3.6655 2.4669 2.4316 2.2412 5.4025 3.3065 2.4652 1.7872 1.5176 1.7379 2.7865 1.5427 3.5772 2.8506 2.8193 3.3904 1.8087 4.5934 2.9408 2.4693 1.6633 2.3742 2.5177 2.3201 3.8846 1.3481 1.4597 1.8579 1.3788 1.3382 1.4345 1.5914 4.0337 1.5129 2.1162 1.2078 1.0983 1.1136 1.0912 1.7034 1.0507 1.0430 6.8180 6.3472 8.4321 1.0864 5.5379 1.0597 1.0359 1.0591 1.0584 1.1020 1.1018 1.0990 1.1061 1.1025 1.0459 1.0766 1.0774 1.0776 1.0958
irintensity: 0.2995 1.9412 5.1765 0.3561 4.6540 0.2393 0.9096 1.8787 4.2573 14.5375 12.0064 3.0994 47.2871 28.8805 5.2976 0.9627 38.5608 20.9787 10.9184 12.4288 3.9435 19.5555 10.6336 59.7977 40.4783 1.6037 13.8015 48.7596 11.4681 86.1917 67.2227 65.6424 161.7323 1.1370 17.7164 182.8034 15.4773 4.0249 47.0578 0.8684 27.8242 3.5067 19.6482 9.0283 11.3521 4.5034 4.8887 2.0672 15.1786 126.9413 53.2557 71.6242 44.9320 104.8401 7.9010 33.7797 37.5653 94.0083 158.7366 7.8082 13.4869 14.6428 20.8346 18.0507 25.5441 174.3414 5.8744 27.0827 330.0044 111.6472 86.3208 35.0738 612.1981 27.7509 22.4660 19.1198 13.6041 16.5191 0.1466 30.4563 4.8990 27.5221 2.2268 75.1200 59.6588 17.5047 2.9089
temp: 298.150 k
press: 1.00000 atm
elementType: 8 8 8 8 7 7 7 7 6 6 6 6 6 6 6 6 6 1 1 1 1 1 1 1 1 1 1 1 1 1 1
symmnumber: 1
zpe: 637193.7 jmol-1
zpe.correction: 0.242694 hartree
zpe.thermalcorrener: 0.260464 hartree
zpe.thermalcorrenthalpy: 0.261409 hartree
zpe.thermalcorrgfe: 0.195515 hartree
zpe.sumelectzpe: -870.020119 hartree
zpe.sumelectthermal: -870.002348 hartree
zpe.sumelectthermalent: -870.001404 hartree
zpe.sumelectthermalfe: -870.067297 hartree
dipole: 0.2236 -3.2673 -0.5377
dipole: 3.3187
quadrupole: -110.1854 -104.6656 -102.4000
quadrupole: -1.7927 -7.4262 0.7769
quadrupole: -4.4351 1.0847 3.3503 -1.7927 -7.4262 0.7769
hfenergy: -870.2628128 hartree
pointgroup: C01 [X(C9H14N4O4)]
dipole: -0.1370951 -1.2639573 0.2974134 debye
polarizability: 152.1009073|5.7894818|148.1687413|12.9551736|-8.3122351|108.7130029 unknown
InChI: InChI=1S/C9H14N4O4/c1-2-9(4-11-5(14)3-10)6(15)12-8(17)13-7(9)16/h11-13H,2-4,10H2,1H3
charge 0 multiplicity 1
31 atoms
O  2.644222 -1.097524 1.715473
O  -0.50186 -0.315798 -1.869853
O  2.432102 3.006008 -0.464305
O  -2.214831 1.335889 0.534103
N  -1.72507 -0.916651 0.83865
N  2.484916 0.939288 0.626928
N  0.913297 1.341734 -1.092882
N  -4.898099 0.750641 -0.343999
C  0.755476 -0.814695 0.175784
C  0.859882 -2.304396 -0.258697
C  -0.373243 -0.660957 1.306088
C  2.042703 -0.369547 0.882288
C  0.341781 0.059299 -1.014773
C  1.959043 -2.58045 -1.305623
C  1.966668 1.850257 -0.317343
C  -2.562117 0.122191 0.436131
C  -3.925686 -0.323025 -0.151101
H  -0.120853 -2.600784 -0.673821
H  1.054689 -2.903685 0.64963
H  -0.357335 0.369164 1.702884
H  -0.099789 -1.365795 2.111266
H  1.777433 -2.019558 -2.239828
H  2.959904 -2.316268 -0.919109
H  1.977175 -3.65438 -1.562474
H  -2.028372 -1.88137 0.696392
H  3.291649 1.273907 1.164337
H  0.535528 1.977002 -1.803288
H  -4.366573 -1.105981 0.496739
H  -3.717953 -0.801798 -1.128651
H  -4.565018 1.470217 -0.995028
H  -5.198167 1.184766 0.535785
