program: Gaussian 09
title: 000257283
version: EM64L-G09RevD.01
frameworkgroup: C1[X(C17H22O5)]
method: RPBEPBE
basis: SDD
operation: Freq
keyword: #pfreq=noraman
keyword: PBEPBE/SDD
title: #p freq=noraman PBEPBE/SDD
converged: YES YES NO NO
title: Mulliken charges:
elementType: O O O O O C C C C C C C C C C C C C C C C C H H H H H H H H H H H H H H H H H H H H H H
charge: -0.219037 -0.282450 -0.192439 -0.198323 -0.236073 0.166705 -0.115375 -0.189736 -0.141470 -0.124418 -0.045799 -0.470779 -0.245611 0.086175 -0.783605 -0.187300 0.153541 -0.754298 -0.353854 -0.708874 0.313398 -0.772302 0.215052 0.222733 0.263419 0.245173 0.247948 0.236233 0.211786 0.266913 0.270688 0.224486 0.228298 0.255358 0.216889 0.230259 0.221456 0.267397 0.227099 0.245370 0.246679 0.245038 0.244555 0.269098
chargesum: 0.00000
title: Mulliken charges with hydrogens summed into heavy atoms:
elementType: O O O O O C C C C C C C C C C C C C C C C C
charge: -0.219037 -0.282450 -0.192439 -0.198323 -0.236073 0.166705 0.099677 0.032997 0.121949 0.120755 0.202149 -0.022760 0.021302 0.086175 -0.060133 0.068058 0.153541 -0.085695 -0.086457 0.010273 0.313398 -0.013611
polarizability: 2.07141543e+02 5.64889783e+00 2.16541952e+02 -1.32838002e+00 1.95780371e+00 1.39892476e+02
1716.lowfreq: -17.5202 -14.8168 -8.6509 0.0004 0.0007 0.0008 2.0440 43.9036 60.9679
frequency: -15.2383 43.8767 60.9554 68.3003 75.2375 94.4453 112.0389 132.7840 151.4926 170.0514 193.6342 200.1470 222.7402 224.8641 237.6256 242.9413 247.6079 256.4414 281.8059 292.5517 300.0244 304.7759 327.7451 347.2642 371.0784 417.7449 421.7313 453.4251 477.0045 516.9359 535.3198 551.6244 593.5031 637.5848 644.3940 662.8561 680.0200 692.6536 702.7635 724.9794 749.8504 764.8231 793.5379 830.2500 847.3803 868.5708 882.7545 902.2930 910.1193 937.1559 938.7664 965.5813 969.8331 974.3427 996.0719 1000.5167 1024.0707 1037.6857 1045.5963 1054.3017 1060.2587 1074.1096 1082.5803 1105.8965 1124.1533 1134.9480 1144.8695 1146.0056 1157.2212 1169.4102 1179.8725 1195.2522 1203.2651 1243.1338 1260.6796 1270.2690 1277.5513 1295.1711 1306.6351 1312.5226 1317.3333 1325.3088 1330.2672 1340.1908 1350.4214 1353.7159 1376.0214 1381.1523 1388.7784 1392.1734 1393.6301 1452.5358 1453.5037 1460.9637 1466.5155 1471.9821 1477.4634 1484.7382 1488.5728 1490.9672 1585.7393 1624.2608 1658.8905 1700.3860 2911.9838 2949.4846 2970.5964 2976.1449 3001.2644 3001.6857 3002.1796 3003.6583 3013.4504 3027.0664 3047.6440 3050.6361 3070.6257 3081.0989 3092.0907 3096.7495 3097.4327 3119.7292 3123.0896 3139.2770 3154.8103 3194.2321
redmass: 3.7028 5.8357 3.8296 5.4458 5.1457 5.0201 1.0423 5.7134 3.2439 5.3574 5.1250 2.1157 2.4424 1.8344 2.5126 2.0777 1.3572 3.2993 4.7920 2.3050 2.3295 2.5080 2.7849 3.6200 3.9559 3.3804 3.0615 3.9870 3.8214 3.5205 3.7403 3.3928 5.2175 5.6313 3.4191 4.7315 6.4958 2.8616 4.2070 4.1205 3.0435 3.7152 2.9641 2.2445 2.8467 2.7540 3.1457 2.5044 1.9960 3.9490 3.2959 1.8482 1.7207 1.4879 1.9756 2.1209 2.1568 1.6734 1.7419 2.4607 1.7462 2.1889 2.3170 1.8790 2.5799 2.1149 3.3916 2.2268 3.1819 2.2323 1.6151 3.1248 2.6493 1.4783 1.3816 1.5054 1.3470 1.3077 1.2639 1.3705 1.3143 1.6561 1.3441 1.4526 1.3147 1.4844 1.2645 1.2713 1.1770 1.1878 1.2033 1.0572 1.0526 1.0838 1.0546 1.0515 1.0565 1.0561 1.0463 1.0463 6.8198 11.0011 9.6049 12.3118 1.0803 1.0814 1.0627 1.0385 1.0368 1.0755 1.0473 1.0378 1.0807 1.0865 1.0859 1.0980 1.0981 1.0992 1.0996 1.0976 1.0949 1.0989 1.0993 1.1020 1.0889 1.1048
irintensity: 0.7879 3.3449 1.9820 6.1253 0.6124 2.4039 0.3984 0.9287 1.9261 2.2656 0.3674 1.2943 1.7395 1.6926 4.0528 1.3199 1.1476 3.3135 0.7191 3.6404 1.7197 1.1152 0.2169 2.5326 4.8331 3.5053 2.0641 1.9827 3.4293 0.6319 9.7865 7.8399 10.8268 7.1613 5.9395 5.9944 2.6562 16.0959 4.9152 2.7277 5.2550 13.5778 2.4403 29.2230 9.7205 18.5974 24.5257 25.4980 27.5741 79.7975 18.7509 42.9750 7.4095 20.2412 87.1752 121.6739 2.1967 11.7341 23.5650 9.9846 16.3934 22.3925 6.6768 9.7554 8.5922 63.5043 19.8997 9.2247 18.1580 8.1465 6.5206 279.4322 34.8407 13.6546 2.8673 11.9826 0.5340 12.0864 1.6360 7.3021 3.5494 6.5122 1.3794 6.4934 1.3679 5.6125 41.2032 24.5089 33.9102 17.3625 16.2600 18.8416 14.8653 7.0692 16.5306 5.4887 8.4820 16.4599 11.7744 15.9862 10.0519 205.3060 161.2531 369.4804 11.2244 11.4316 7.9937 34.1940 14.8725 11.8966 15.7203 1.7266 14.9814 18.7471 3.2114 24.7027 52.3497 35.1432 24.0043 19.8349 7.8690 10.8620 19.0649 9.7228 6.8531 9.4370
temp: 298.150 k
press: 1.00000 atm
elementType: 8 8 8 8 8 6 6 6 6 6 6 6 6 6 6 6 6 6 6 6 6 6 1 1 1 1 1 1 1 1 1 1 1 1 1 1 1 1 1 1 1 1 1 1
symmnumber: 1
zpe: 943857.9 jmol-1
zpe.correction: 0.359496 hartree
zpe.thermalcorrener: 0.380168 hartree
zpe.thermalcorrenthalpy: 0.381112 hartree
zpe.thermalcorrgfe: 0.311685 hartree
zpe.sumelectzpe: -1035.446494 hartree
zpe.sumelectthermal: -1035.425822 hartree
zpe.sumelectthermalent: -1035.424878 hartree
zpe.sumelectthermalfe: -1035.494306 hartree
dipole: -5.4529 -1.2393 1.9923
dipole: 5.9363
quadrupole: -142.8883 -142.0795 -129.5121
quadrupole: 25.2205 5.1045 9.0877
quadrupole: -4.7283 -3.9196 8.6478 25.2205 5.1045 9.0877
hfenergy: -1035.8059905 hartree
pointgroup: C01 [X(C17H22O5)]
dipole: -1.3965628 -1.600596 0.9707412 debye
polarizability: 205.320407|-3.3741519|217.2898253|-0.5445309|-9.4052091|140.9657391 unknown
InChI: InChI=1S/C17H22O5/c1-8-7-12-14(9(2)16(20)22-12)15(21-10(3)18)17(4)11(8)5-6-13(17)19/h5-6,8-9,11-12,14-15H,7H2,1-4H3
charge 0 multiplicity 1
44 atoms
O  3.290889 -0.389409 0.424734
O  -0.611842 1.861066 0.182953
O  -3.340712 0.70106 -0.545079
O  4.719396 1.013766 -0.744233
O  -1.025547 2.94547 -1.8489
C  -1.231491 -0.492486 0.1267
C  1.192907 0.238602 -0.588664
C  -0.83006 -1.964922 -0.266223
C  -0.320416 0.590721 -0.534161
C  1.805365 -0.579943 0.587622
C  0.17215 -2.679876 0.687834
C  1.608231 -2.106299 0.526426
C  2.239664 1.37116 -0.851724
C  -2.703524 -0.375497 -0.390848
C  -1.367174 -0.306268 1.671751
C  -2.176941 -2.640262 -0.499073
C  3.559464 0.690383 -0.445565
C  0.231135 -4.206709 0.432984
C  -3.207727 -1.752494 -0.609924
C  2.160079 2.704864 -0.054297
C  -1.090641 2.930424 -0.601568
C  -1.679889 4.001073 0.282077
H  1.283899 -0.43087 -1.471882
H  -0.337402 -1.942983 -1.266889
H  -0.644794 0.752486 -1.5814
H  1.549237 -0.157327 1.575564
H  -0.161575 -2.527965 1.731233
H  2.256853 -2.557418 1.30084
H  2.013929 -2.440352 -0.451274
H  2.290514 1.618738 -1.925971
H  -1.843288 0.664087 1.879457
H  -1.998384 -1.105839 2.099165
H  -0.395544 -0.320206 2.190147
H  -2.267811 -3.722564 -0.635248
H  0.444056 -4.428114 -0.630728
H  1.03586 -4.666373 1.034996
H  -0.712413 -4.709609 0.708394
H  -4.249899 -1.972023 -0.852564
H  1.9199 2.542353 1.009867
H  3.139978 3.210563 -0.121523
H  1.405848 3.378978 -0.485188
H  -1.706904 4.961911 -0.252729
H  -1.115675 4.095315 1.223717
H  -2.715399 3.705592 0.533193
