program: Gaussian 09
title: 000257279
version: EM64L-G09RevD.01
frameworkgroup: C1[X(C15H20O3)]
method: RPBEPBE
basis: SDD
operation: Freq
keyword: #pfreq=noraman
keyword: PBEPBE/SDD
title: #p freq=noraman PBEPBE/SDD
converged: YES YES NO NO
title: Mulliken charges:
elementType: O O O C C C C C C C C C C C C C C C H H H H H H H H H H H H H H H H H H H H
charge: -0.438922 -0.229657 -0.204597 -0.154907 0.188458 -0.496747 0.230434 -0.206779 -0.500517 -0.584867 -0.113510 0.217263 -0.543011 -0.771772 0.299869 -0.849151 0.076980 -0.690661 0.233494 0.229391 0.176447 0.263203 0.227416 0.237891 0.228449 0.229782 0.254933 0.242863 0.226845 0.237816 0.238911 0.217438 0.325552 0.248869 0.234138 0.233421 0.226639 0.258596
chargesum: 0.00000
title: Mulliken charges with hydrogens summed into heavy atoms:
elementType: O O O C C C C C C C C C C C C C C C
charge: -0.113369 -0.229657 -0.204597 0.078587 0.188458 -0.090909 0.230434 0.056424 -0.035210 -0.126635 0.141423 0.217263 -0.073303 -0.077606 0.299869 -0.132723 0.076980 -0.205426
polarizability: 1.95687727e+02 -2.08242958e+00 1.74537006e+02 1.05608911e+01 -7.39205710e+00 1.21032654e+02
1716.lowfreq: -7.2522 -0.0009 -0.0009 -0.0009 3.0682 8.4850 39.3099 72.5006 85.4663
frequency: 39.1719 72.4977 85.4574 103.0688 132.3673 151.9268 166.9064 174.8071 205.8930 233.0990 258.4657 263.8618 275.8274 292.4124 306.4720 307.9957 325.8026 335.8670 374.5827 390.7171 421.2684 454.3282 497.0029 528.9231 531.8351 558.9569 578.7199 590.1538 616.6798 648.1759 701.5249 728.7827 741.2902 775.5124 785.4263 816.5510 833.2914 894.0364 911.5609 919.0123 935.7524 945.2757 955.8886 977.6715 987.8996 996.2232 1006.3037 1029.6707 1037.1477 1046.1569 1062.8122 1070.3432 1074.4151 1093.7063 1137.0996 1146.6466 1159.3029 1171.8049 1192.3697 1196.8429 1213.6729 1228.6356 1245.3131 1261.5106 1276.6121 1282.2992 1285.8993 1297.2038 1310.8825 1321.0075 1337.4315 1345.3476 1356.3992 1362.7043 1388.2767 1395.5358 1418.9495 1454.2866 1458.9260 1465.6267 1469.2955 1471.5948 1475.4129 1479.2929 1481.0037 1674.9817 1685.7655 1696.1844 2927.8707 2954.8172 2959.6209 2961.1823 2964.4410 2975.2924 2976.8378 3012.5876 3028.0648 3029.4243 3033.6981 3037.9041 3063.3755 3076.1302 3082.0765 3088.0925 3094.6740 3097.5725 3205.2588 3546.0808
redmass: 4.1793 5.0727 3.6313 4.3803 2.4601 1.2246 2.9671 2.7100 2.9796 1.8039 2.1941 1.4178 1.1969 3.4311 3.0717 4.5486 3.9155 2.8429 3.7337 3.0123 3.2697 3.0850 3.5713 3.5695 2.6442 2.8673 3.1510 4.2450 3.4664 3.1890 2.9916 3.2129 3.9515 2.6961 2.0421 2.3262 2.0925 2.0818 2.4479 2.7880 3.0242 1.7962 1.8149 1.3950 1.9364 2.0628 1.8733 2.6910 2.1277 2.2324 1.7297 2.3619 1.7609 1.9114 2.2383 2.2153 2.3178 1.3576 1.5623 1.4664 2.0226 1.7332 2.0623 1.4607 1.6026 1.3908 1.4169 1.4566 1.4494 1.4848 1.8248 1.6134 1.5090 1.7180 1.2443 1.2181 1.1810 1.0855 1.0735 1.0666 1.0674 1.0633 1.0589 1.0673 1.0821 6.9639 11.0276 8.3284 1.0810 1.0761 1.0567 1.0546 1.0632 1.0427 1.0576 1.0656 1.0965 1.0933 1.0946 1.0966 1.0973 1.0892 1.1039 1.0997 1.0958 1.0617 1.1153 1.0657
irintensity: 1.9715 3.2369 0.1423 1.2700 1.1767 0.7002 1.0946 0.0750 1.8193 0.4719 7.8182 56.7561 73.6205 4.9787 19.9428 3.8664 2.4201 0.7626 2.6296 7.7933 6.7156 6.2566 1.3538 4.6137 11.2203 1.0756 1.4291 7.0589 4.3341 2.0081 1.6235 3.0478 2.0718 0.7245 8.3499 1.8094 1.9946 1.2850 48.0279 67.5076 43.5348 0.0769 5.1129 36.4540 16.0025 17.6070 11.1953 94.5457 55.3456 5.9269 4.9617 4.2566 92.7027 26.8227 9.6243 0.5786 26.3538 3.9012 8.3606 0.9333 26.6458 13.2961 52.1640 18.1675 4.6995 7.1912 4.4500 16.7847 4.0423 4.0403 3.7728 6.6498 7.3002 12.6841 29.6537 15.7106 27.4654 5.9141 10.7169 17.5628 11.3610 4.5142 1.4743 4.1042 10.2829 51.5612 271.0410 1.5228 15.1588 15.8570 4.1942 63.5125 12.9342 25.8298 22.9686 21.1285 23.7920 18.1451 23.6079 21.7845 25.8898 22.9428 29.2689 38.6038 27.5881 5.0753 3.9056 3.9490
temp: 298.150 k
press: 1.00000 atm
elementType: 8 8 8 6 6 6 6 6 6 6 6 6 6 6 6 6 6 6 1 1 1 1 1 1 1 1 1 1 1 1 1 1 1 1 1 1 1 1
symmnumber: 1
zpe: 834446.8 jmol-1
zpe.correction: 0.317824 hartree
zpe.thermalcorrener: 0.335066 hartree
zpe.thermalcorrenthalpy: 0.336010 hartree
zpe.thermalcorrgfe: 0.274155 hartree
zpe.sumelectzpe: -807.875221 hartree
zpe.sumelectthermal: -807.857980 hartree
zpe.sumelectthermalent: -807.857036 hartree
zpe.sumelectthermalfe: -807.918890 hartree
dipole: -4.7125 -0.8971 1.8175
dipole: 5.1298
quadrupole: -141.9397 -99.4369 -107.5699
quadrupole: -9.6926 -1.9995 -3.2059
quadrupole: -25.6242 16.8786 8.7456 -9.6926 -1.9995 -3.2059
hfenergy: -808.1930455 hartree
pointgroup: C01 [X(C15H20O3)]
dipole: 1.8505813 0.3765908 0.7118862 debye
polarizability: 195.7098156|-1.8605735|174.5347517|-10.7222896|7.1100889|121.0128199 unknown
InChI: InChI=1S/C15H20O3/c1-8-6-13-11(9(2)14(16)18-13)7-12-10(8)4-5-15(12,3)17/h11-13,17H,2,4-7H2,1,3H3
charge 0 multiplicity 1
38 atoms
O  2.887393 2.375669 -0.881959
O  -2.913351 -0.99347 -0.766892
O  -4.786676 0.091943 0.099608
C  1.315058 0.468589 -0.39216
C  2.684651 1.163642 -0.061388
C  0.06966 1.115619 0.247397
C  1.570736 -1.005507 -0.045466
C  -1.230125 0.736345 -0.490967
C  3.701798 0.108405 -0.548188
C  3.090263 -1.248945 -0.113144
C  -1.419419 -0.796928 -0.716116
C  0.653357 -1.946439 0.323478
C  -0.857554 -1.705796 0.39055
C  2.85351 1.501797 1.433183
C  -2.529823 1.135229 0.189183
C  1.059507 -3.360833 0.706559
C  -3.562737 0.08765 -0.121641
C  -2.816759 2.221055 0.947499
H  1.228066 0.571654 -1.498202
H  -0.003769 0.834429 1.314534
H  0.169009 2.221424 0.214643
H  -1.208779 1.214029 -1.493628
H  4.713075 0.280954 -0.142809
H  3.760827 0.183121 -1.649485
H  3.480896 -1.552225 0.878598
H  3.353827 -2.061394 -0.815265
H  -1.046546 -1.126481 -1.698938
H  -1.374697 -2.679438 0.293528
H  -1.153961 -1.307483 1.383791
H  2.727443 0.603806 2.064584
H  3.86069 1.91812 1.609924
H  2.109756 2.249946 1.76898
H  2.332867 3.109929 -0.512472
H  2.151508 -3.490532 0.775802
H  0.676436 -4.09564 -0.029964
H  0.619924 -3.64126 1.68443
H  -2.069408 2.986394 1.183744
H  -3.828648 2.353318 1.347771
