program: Gaussian 09
title: 000257274
version: EM64L-G09RevD.01
frameworkgroup: C1[X(C15H20O3)]
method: RPBEPBE
basis: SDD
operation: Freq
keyword: #pfreq=noraman
keyword: PBEPBE/SDD
title: #p freq=noraman PBEPBE/SDD
converged: YES YES NO NO
title: Mulliken charges:
elementType: O O O C C C C C C C C C C C C C C C H H H H H H H H H H H H H H H H H H H H
charge: -0.223318 -0.457622 -0.205748 0.415781 -0.211943 -0.521680 -0.539112 -0.292847 -0.111993 -0.141219 0.539677 -0.476373 -0.842736 -0.607728 0.379177 0.084651 -0.783801 -0.724037 0.200024 0.272309 0.204099 0.223102 0.244188 0.255944 0.237716 0.183088 0.194778 0.247365 0.258543 0.258979 0.222624 0.208036 0.224057 0.338507 0.232223 0.220347 0.235338 0.259604
chargesum: 0.00000
title: Mulliken charges with hydrogens summed into heavy atoms:
elementType: O O O C C C C C C C C C C C C C C C
charge: -0.223318 -0.119115 -0.205748 0.415781 -0.011919 -0.045272 -0.071822 -0.036903 0.125723 0.041868 0.539677 -0.034230 -0.102591 -0.175635 0.379177 0.084651 -0.331231 -0.229095
polarizability: 1.95236488e+02 -1.51685299e+01 1.64235265e+02 -5.72829447e+00 2.64188480e+00 1.29473075e+02
1716.lowfreq: -19.6201 -5.9272 -0.0009 -0.0008 -0.0003 2.9528 53.6086 69.1927 101.5036
frequency: 53.5476 69.1916 101.4916 110.8783 142.7192 174.3753 193.0282 216.6664 225.0280 238.7643 253.5791 272.0375 281.2365 304.0780 312.6345 337.9582 351.7770 389.2742 419.6237 434.8357 459.9393 475.2847 510.3134 533.7325 547.8102 603.6595 608.2868 656.6019 674.4605 688.9396 708.7645 733.6665 752.9354 787.7615 814.0705 830.3936 839.8393 857.3652 895.3317 926.8766 928.5816 936.2589 941.8461 957.8782 985.1825 990.4634 992.5389 1003.4947 1026.7092 1042.4877 1043.8245 1070.7777 1094.4588 1105.3671 1128.6154 1146.1443 1161.2893 1171.7692 1183.9083 1192.3271 1215.6956 1231.2166 1247.3499 1256.3693 1263.7856 1292.9443 1296.1578 1308.9068 1314.6820 1320.4860 1323.3832 1331.4980 1352.7511 1363.3270 1365.1826 1377.3694 1398.4191 1421.5275 1432.8950 1446.8217 1461.6336 1466.6908 1476.7875 1491.7944 1500.0339 1664.9118 1676.5328 1684.3744 2885.3304 2895.3283 2951.9654 2966.4784 2976.3525 2993.9825 2995.6717 2998.0193 3025.8723 3043.3227 3055.3546 3056.1620 3062.2201 3088.5262 3095.8461 3096.5332 3102.0352 3194.6060 3205.1942 3567.4458
redmass: 4.6552 5.7538 4.0740 3.7325 4.0334 4.3873 1.6517 4.0995 1.6021 3.7569 1.1514 2.1831 3.2376 2.8808 3.5438 2.0972 3.5423 2.9664 4.0092 3.9406 3.1078 2.4946 3.6789 2.8171 2.7124 4.2717 6.0172 3.3165 2.2611 1.7282 2.3029 3.0417 1.7409 2.4593 3.1769 3.2181 2.2553 2.0628 2.2360 2.0899 1.9815 1.4179 2.3617 1.9895 1.5381 1.7951 2.4363 2.1264 2.0131 1.9804 3.8801 2.3678 2.0486 2.0626 1.5596 2.0288 1.6136 1.3783 1.6687 1.6594 1.6985 1.2623 1.8115 1.8047 1.7844 1.5348 1.2866 1.4090 1.5106 1.3338 1.4226 1.5431 1.4993 1.7925 1.3695 1.4293 1.2505 1.1725 1.1648 1.0794 1.0942 1.0824 1.0822 1.0638 1.0544 5.3001 7.6340 9.5689 1.0810 1.0818 1.0663 1.0684 1.0648 1.0427 1.0631 1.0759 1.0875 1.0946 1.0995 1.0990 1.0925 1.0986 1.0629 1.0618 1.0987 1.1128 1.1154 1.0662
irintensity: 1.6927 1.6134 1.3347 0.8343 0.2572 1.2629 6.3960 4.3381 6.5717 1.5615 112.2347 0.8424 6.0711 0.9800 17.1603 2.5595 2.4045 0.9561 0.4307 1.6160 1.6761 0.6996 0.1539 2.8918 2.4283 2.4418 7.8841 19.8180 7.3546 0.8731 1.7864 0.5605 0.3203 11.0552 17.1001 27.1580 0.8414 10.5926 5.8277 50.9342 7.2115 73.6986 9.9221 41.0218 44.7096 33.6498 73.2045 13.4928 2.6995 5.1896 171.2254 3.4581 4.7616 13.2969 32.3879 0.9083 18.5774 14.9160 2.1495 2.5487 25.6754 17.3562 22.6606 18.1150 11.8609 6.7427 0.4694 1.2697 16.9882 3.5140 2.6682 8.4625 2.2872 3.8784 5.0300 7.3706 18.3551 18.4161 11.6478 12.7343 17.5720 10.6357 4.6744 1.2085 8.4715 27.0850 93.2964 189.8841 2.9073 84.4440 30.9617 16.1837 65.0436 9.8386 56.7516 12.0055 19.3392 32.4680 10.5681 55.7422 7.7394 15.2746 8.0508 4.5942 9.4337 21.6311 3.2733 2.8582
temp: 298.150 k
press: 1.00000 atm
elementType: 8 8 8 6 6 6 6 6 6 6 6 6 6 6 6 6 6 6 1 1 1 1 1 1 1 1 1 1 1 1 1 1 1 1 1 1 1 1
symmnumber: 1
zpe: 838178.2 jmol-1
zpe.correction: 0.319245 hartree
zpe.thermalcorrener: 0.335782 hartree
zpe.thermalcorrenthalpy: 0.336726 hartree
zpe.thermalcorrgfe: 0.276829 hartree
zpe.sumelectzpe: -807.867015 hartree
zpe.sumelectthermal: -807.850478 hartree
zpe.sumelectthermalent: -807.849534 hartree
zpe.sumelectthermalfe: -807.909431 hartree
dipole: 4.6589 2.7426 -4.5285
dipole: 7.0522
quadrupole: -108.2403 -111.0622 -108.8118
quadrupole: -11.0908 9.9667 4.5162
quadrupole: 1.1311 -1.6908 0.5597 -11.0908 9.9667 4.5162
hfenergy: -808.18626 hartree
pointgroup: C01 [X(C15H20O3)]
dipole: 1.8648704 -1.0400797 1.771644 debye
polarizability: 194.2967952|16.0207029|165.1203654|5.7883692|3.1470221|129.5276679 unknown
InChI: InChI=1S/C15H20O3/c1-8-4-5-13(16)15(3)7-12-10(6-11(8)15)9(2)14(17)18-12/h10-13,16H,1-2,4-7H2,3H3
charge 0 multiplicity 1
38 atoms
O  -2.10381 1.413901 -0.36998
O  2.697996 2.553759 0.083852
O  -4.037852 0.612659 -1.403689
C  1.116366 0.692339 0.026411
C  0.94591 -0.813197 0.475328
C  0.104529 1.565942 0.822331
C  -0.494329 -1.299172 0.219467
C  -1.543264 -0.481224 1.027033
C  -1.3358 1.054458 0.886951
C  2.552183 1.130889 0.44482
C  2.036101 -1.693526 -0.13628
C  3.654368 0.26275 -0.190159
C  0.915664 0.876295 -1.501691
C  3.451746 -1.230432 0.186822
C  -2.929665 -0.656549 0.430183
C  -3.145555 0.468439 -0.548527
C  1.80059 -2.785394 -0.909588
C  -3.856842 -1.619749 0.6477
H  1.112056 -0.82065 1.580752
H  0.107717 2.594785 0.421857
H  0.454806 1.643157 1.873411
H  -0.597207 -2.363914 0.501233
H  -0.720922 -1.234724 -0.861207
H  -1.499063 -0.774898 2.091498
H  -1.870356 1.577428 1.704216
H  2.627044 1.02868 1.555015
H  4.649526 0.603942 0.162888
H  3.634689 0.388329 -1.288267
H  -0.152827 0.869722 -1.770946
H  1.326063 1.854394 -1.805717
H  1.423898 0.084311 -2.079909
H  3.6328 -1.344868 1.277595
H  4.196354 -1.860136 -0.332252
H  3.631752 2.835229 0.254302
H  0.790361 -3.127079 -1.157503
H  2.627284 -3.374452 -1.32459
H  -3.694757 -2.434067 1.362656
H  -4.806654 -1.599581 0.100985
