program: Gaussian 09
title: 000258491
version: EM64L-G09RevD.01
frameworkgroup: C1[X(C8H6N4O)]
method: RPBEPBE
basis: SDD
operation: Freq
keyword: #pfreq=noraman
keyword: PBEPBE/SDD
title: #p freq=noraman PBEPBE/SDD
converged: YES YES NO NO
title: Mulliken charges:
elementType: O N N N N C C C C C C C C H H H H H H
charge: -0.197694 -0.186145 -0.363766 -0.023208 -0.004795 0.347643 -0.104178 -0.463677 -0.232805 0.037530 -0.237389 0.207595 -0.450956 0.276284 0.258233 0.270470 0.333548 0.240113 0.293196
chargesum: 0.00000
title: Mulliken charges with hydrogens summed into heavy atoms:
elementType: O N N N N C C C C C C C C
charge: -0.197694 -0.186145 -0.030217 -0.023208 -0.004795 0.347643 -0.104178 0.070840 0.037665 0.037530 0.002723 0.207595 -0.157760
polarizability: 1.48408579e+02 6.55377533e+00 1.25251650e+02 -2.18139295e+00 2.25400982e+00 5.57748177e+01
1716.lowfreq: -3.3559 0.0003 0.0006 0.0007 1.1663 6.8736 43.1586 76.6597 106.4242
frequency: 43.1546 76.6538 106.4219 147.3318 210.6845 237.2999 292.2981 307.4677 330.2840 432.0065 476.5623 492.6749 514.0053 576.8897 595.5176 624.1719 657.4583 661.2741 673.2647 692.3505 750.2719 758.0933 787.8226 863.0102 890.0611 928.8346 945.4985 954.7333 1020.3604 1085.4588 1149.1328 1180.4918 1261.4176 1279.9621 1323.2368 1327.7757 1354.5407 1367.1518 1425.9531 1462.6123 1512.4192 1536.7000 1599.8435 1636.7632 2148.1036 2982.1975 3049.7562 3123.2940 3229.8109 3415.0821 3517.9166
redmass: 5.1685 5.1089 6.6718 4.5169 4.6851 5.2635 6.1570 2.9790 8.8353 6.5914 8.8065 3.5931 6.8589 1.2740 5.7623 3.2752 1.2308 11.8851 7.0448 1.2915 3.7702 2.2392 4.2752 7.8445 1.4619 7.4349 3.6893 2.0376 4.6897 3.6363 2.5730 1.9401 1.9826 1.6144 1.8810 4.3530 1.4750 1.9124 3.2347 1.1272 4.0048 6.3905 6.5546 12.4663 5.9600 1.0637 1.0969 1.0926 1.0986 1.1617 1.0797
irintensity: 5.5967 1.5218 0.6374 0.7432 2.1081 3.2094 6.2489 11.5405 0.1659 0.4527 1.7297 6.7196 1.8991 110.0602 7.0575 2.8856 67.0065 5.6499 12.1137 48.6339 52.1748 24.4499 0.4527 8.9050 11.4037 44.4513 13.2227 6.4682 6.6222 44.1899 21.5918 31.9333 1.4467 2.9060 18.0971 67.7945 4.7676 41.8874 9.0094 5.9887 11.0830 312.4271 59.6046 385.3234 0.5779 20.4504 1.9110 18.9476 0.0932 76.9873 79.2776
temp: 298.150 k
press: 1.00000 atm
elementType: 8 7 7 7 7 6 6 6 6 6 6 6 6 1 1 1 1 1 1
symmnumber: 1
zpe: 347013.2 jmol-1
zpe.correction: 0.132170 hartree
zpe.thermalcorrener: 0.142936 hartree
zpe.thermalcorrenthalpy: 0.143881 hartree
zpe.thermalcorrgfe: 0.095008 hartree
zpe.sumelectzpe: -601.684348 hartree
zpe.sumelectthermal: -601.673582 hartree
zpe.sumelectthermalent: -601.672638 hartree
zpe.sumelectthermalfe: -601.721511 hartree
dipole: -11.9349 -2.3013 1.6780
dipole: 12.2700
quadrupole: -91.4488 -66.5595 -73.7040
quadrupole: -1.7601 1.9996 2.5259
quadrupole: -14.2114 10.6779 3.5335 -1.7601 1.9996 2.5259
hfenergy: -601.8165185 hartree
pointgroup: C01 [X(C8H6N4O1)]
dipole: 4.5602447 -1.5042211 -0.4951595 debye
dipolederiv: -1.1565737 0.2648508 0.076692 0.3932765 -0.5400629 -0.0322988 0.0740543 -0.0158276 -0.3506142 -0.7744529 0.0886587 0.0552811 0.1449316 -0.3270682 0.0572479 0.013778 0.0576313 -0.1505735 -0.9725858 -0.0921107 0.123227 -0.1417906 -0.7179575 0.0618837 0.1896039 0.0325615 -0.2166652 -0.5037044 0.0817106 -0.0044385 0.086228 -0.2840731 0.0093669 0.0424956 -0.0135522 -0.2147388 -0.7875604 0.123383 0.0483293 0.5327245 -0.6989886 -0.0267704 -0.0031611 0.0342239 -0.2743818 0.6502529 -0.0755898 -0.0307203 0.1077751 0.5097485 -0.0486965 -0.0942276 -0.0664148 0.1180234 -0.6051205 0.2095376 0.0458227 0.0190013 -0.0133585 0.0048219 0.0841004 -0.0270961 -0.0498233 0.8004097 -0.1790051 0.0128131 -0.1537227 0.2424461 0.0024538 -0.0081232 0.0000748 0.3702215 0.3149502 -0.2720544 -0.0044663 -0.527945 0.3604588 -0.034399 0.0203925 0.000031 -0.1005982 1.6050567 -0.3628375 -0.139735 -0.5013389 0.9738813 -0.0188933 -0.1467623 -0.038887 0.2761668 1.3490249 0.1143814 -0.2178249 -0.0313377 0.4032302 -0.0429875 -0.2103778 -0.0699563 0.0305363 -0.2416048 0.0171965 0.0361916 -0.0770165 0.0113104 -0.0827022 0.0711698 -0.0472029 -0.0819829 -0.3281164 -0.000524 -0.0071828 0.1092197 -0.3340315 0.0450045 -0.1194907 0.0320485 -0.2641229 -0.0239153 0.0496351 -0.0396342 0.1054308 0.0508597 -0.0459338 0.0438559 -0.0262929 -0.0650425 0.0333371 0.012527 -0.0226894 -0.062682 -0.0376007 0.0426225 -0.0207152 0.0116327 0.1070176 0.0192307 -0.0676023 0.0354651 -0.0348166 0.0808168 0.0199117 0.025113 0.0235271 0.1803286 0.2783406 0.0110868 0.0398247 0.0093707 0.1705684 0.0550033 0.0132797 0.0753887 0.3080321 0.0711778 0.0821544 -0.0048574 0.0390088 -0.1027909 0.0275589 0.0068538 0.0282467 0.1290942 0.2718532 -0.0053981 -0.0020979 -0.0163171 0.2526117 0.0068063 0.0181609 0.0098634 0.249123 unknown
polarizability: 146.6367097|-10.0730537|120.6660234|-4.2014672|-19.598708|62.1323134 unknown
InChI: InChI=1S/C8H6N4O/c1-2-3-12-5-11-6-7(12)9-4-10-8(6)13/h1,4-5,9H,3H2
charge 0 multiplicity 1
19 atoms
O  -3.504381 0.734153 0.225476
N  1.125014 0.729187 -0.529948
N  0.023294 -1.470084 -0.015887
N  -0.74649 2.046148 -0.418884
N  -2.367319 -1.334117 0.337409
C  0.053133 -0.102685 -0.226888
C  -1.100189 0.706409 -0.159954
C  2.522396 0.344351 -0.821674
C  0.571672 2.031426 -0.634892
C  -2.415817 0.114808 0.138071
C  -1.245634 -2.010967 0.268308
C  3.071322 -0.641361 0.129026
C  3.542904 -1.483487 0.894623
H  2.59225 -0.060355 -1.850931
H  3.13074 1.266408 -0.792688
H  1.190826 2.897153 -0.861737
H  0.873653 -2.036558 0.036951
H  -1.250009 -3.094887 0.438907
H  3.971134 -2.194745 1.579414
