program: Gaussian 09
title: 000257271
version: EM64L-G09RevD.01
frameworkgroup: C1[X(C20H28N2O6)]
method: RPBEPBE
basis: SDD
operation: Freq
keyword: #p
keyword: freq=noraman
keyword: PBEPBE/SDD
title: #p freq=noraman PBEPBE/SDD
converged: YES YES NO NO
title: Mulliken charges:
elementType: O O O O O O N N C C C C C C C C C C C C C C C C C C C C H H H H H H H H H H H H H H H H H H H H H H H H H H H H
charge: -0.281456 -0.278956 -0.438614 -0.468565 -0.223387 -0.209211 -0.174618 -0.407987 0.106762 0.378717 -0.561337 0.238480 0.459849 -0.296345 -0.589360 -0.402635 -0.374846 -0.375880 -0.457883 -0.435509 0.236999 0.260971 -0.328316 -0.300437 -0.259533 -0.233359 -0.666926 -0.697062 0.229804 0.240594 0.272677 0.238414 0.270570 0.297942 0.220459 0.218097 0.233995 0.265715 0.216942 0.237650 0.192580 0.242284 0.224421 0.192560 0.213666 0.241637 0.230618 0.227275 0.336200 0.349293 0.252497 0.225012 0.217904 0.264497 0.226444 0.200697
chargesum: 0.00000
title: Mulliken charges with hydrogens summed into heavy atoms:
elementType: O O O O O O N N C C C C C C C C C C C C C C C C C C C C
charge: -0.281456 -0.278956 -0.102415 -0.119272 -0.223387 -0.209211 -0.174618 -0.110045 0.106762 0.378717 -0.090939 0.238480 0.459849 -0.023668 -0.350946 -0.132066 -0.154387 -0.157782 0.041826 0.019084 0.236999 0.260971 0.106548 0.116544 0.195770 0.224535 0.028487 -0.005424
polarizability: 3.40158148e+02 -2.39387784e+01 2.57370614e+02 1.34787814e+01 1.04242263e+01 1.77571035e+02
1716.lowfreq: -9.5152 -1.6650 -0.0008 -0.0007 0.0003 4.0592 15.1295 21.4621 26.5733
frequency: 15.0405 21.3905 26.5604 38.1996 40.8433 49.4564 57.4179 60.9262 66.0627 74.9513 84.6474 88.9469 103.8978 107.5754 119.9015 121.1246 134.2975 145.2172 168.7846 184.0602 214.3557 222.1783 235.0938 244.1296 250.7302 261.5706 268.3180 285.7592 292.1559 313.0358 330.5483 337.8886 340.5837 362.8625 376.6809 394.1237 426.1025 429.9544 438.1073 468.6020 472.6829 505.0565 521.6661 548.0129 561.0819 589.2856 605.5286 636.5786 649.9775 667.0222 701.8140 733.9853 746.4599 760.1995 774.5011 780.4218 786.2741 801.3663 804.4463 810.2983 817.0553 841.1542 842.0127 847.8960 871.0834 878.5222 890.2189 912.5086 930.2134 951.1027 959.0796 980.0643 1012.1142 1016.4237 1022.3465 1027.2178 1028.6348 1047.3804 1060.6275 1078.4182 1091.2276 1095.8159 1100.3579 1114.3920 1137.9671 1144.0917 1151.9030 1156.5613 1163.2521 1184.8161 1198.0088 1207.9037 1216.4650 1231.7684 1249.2410 1250.2786 1264.8544 1267.9573 1278.1107 1286.3745 1293.7224 1300.2976 1313.5928 1336.6965 1344.0745 1350.6905 1355.3247 1359.0532 1359.7282 1376.9990 1381.4698 1390.0711 1390.7633 1394.5550 1407.9516 1427.0781 1455.8016 1457.0183 1463.2691 1466.1942 1468.8950 1469.2607 1472.9786 1475.9239 1476.6711 1484.0167 1484.3668 1493.0626 1503.7763 1558.7926 1591.6204 1628.5686 1642.2672 1665.4589 2939.6638 2965.9072 2986.0017 2991.0345 2993.1256 2994.2361 2996.2002 3002.8967 3011.8463 3017.6808 3028.8231 3047.8233 3052.5802 3060.5360 3068.0135 3081.2155 3087.1075 3092.3147 3098.2713 3098.9030 3117.7190 3128.0822 3152.0955 3164.7271 3234.8763 3556.4748 3580.2916 3617.9117
redmass: 5.2325 5.0580 4.7703 5.2761 4.9672 5.9112 4.1142 4.5613 5.5113 4.9176 3.3395 3.3745 4.0424 3.5416 2.5872 3.1063 3.5813 2.9508 3.5649 2.1459 2.0253 3.8629 2.2379 1.3029 1.8332 2.6645 2.1834 2.0707 5.2093 3.7174 4.1572 3.1101 1.7737 3.4207 3.5276 3.7145 2.7466 3.5009 2.9315 3.4529 1.3879 4.4687 2.1436 4.2056 5.0362 3.2264 3.2268 4.4288 3.8936 4.3183 5.1831 5.2405 3.8987 2.4661 2.4514 2.1949 2.8160 1.2524 1.1193 1.6588 1.5460 3.5060 3.3158 1.6408 3.1882 4.0698 3.2540 1.3254 2.4126 4.4551 2.6931 2.8569 3.1459 2.8009 2.8045 3.3840 2.8900 1.7779 2.5939 1.8701 2.2707 1.7621 2.1230 2.1979 1.4651 1.5773 2.3751 1.6613 1.3857 1.6526 1.3771 1.1534 1.5007 1.8087 1.7614 1.3235 1.4593 1.4875 1.1172 1.2646 1.2465 1.8391 1.7262 1.5458 1.3999 1.3961 1.3610 1.3810 1.4631 1.4996 1.4658 1.2329 1.4051 4.7044 1.2454 2.7764 1.1001 1.3805 1.0438 1.1511 1.1448 1.0658 1.7231 1.3155 1.1139 1.6617 1.0534 1.0598 1.3748 5.9143 5.7986 10.3298 7.2886 10.8530 1.0597 1.0695 1.0361 1.0617 1.0362 1.0777 1.0615 1.0584 1.0646 1.0995 1.0587 1.1022 1.1016 1.1063 1.1008 1.0982 1.0982 1.1033 1.0966 1.1024 1.1058 1.0888 1.0897 1.0931 1.0980 1.0662 1.0667 1.0808
irintensity: 0.7494 0.4081 1.5644 0.2313 1.6319 1.5113 1.5545 2.5504 0.9247 1.8319 0.4589 3.3344 1.7076 5.0947 4.2048 2.6447 0.9953 0.9325 1.9294 1.4018 1.6215 4.0562 46.4593 120.3530 9.0494 1.9941 19.1222 24.6830 7.9080 7.3207 15.4679 2.3388 185.2822 5.0884 2.6737 2.3276 12.9770 2.2496 5.8205 5.0139 73.8621 38.9104 7.0479 19.0573 4.4529 5.8581 2.4406 7.3720 9.1721 3.1955 8.5508 0.4829 2.3224 0.2966 24.9036 41.4861 9.0881 4.7326 10.1410 16.1128 4.2688 1.0865 7.6432 29.3722 8.4882 12.9233 3.8553 1.6568 35.0572 71.1701 73.9893 37.4624 25.1905 54.5506 43.1717 24.4817 172.8940 1.4111 92.3281 36.9991 237.3295 6.2227 40.3675 17.4404 3.6106 67.3356 57.4048 2.6608 26.5910 53.4796 75.8781 13.0289 13.1952 15.9629 9.0044 4.0322 27.3161 44.1202 3.8602 16.5737 1.7198 3.2777 58.1665 26.0305 13.6667 35.8153 19.6443 32.9341 2.5829 40.4860 1.2674 26.0871 5.0182 15.9236 23.8181 9.4351 11.4530 36.4450 15.0418 2.0621 16.2104 13.4144 28.7987 39.0637 8.1857 98.1405 18.8279 11.8942 65.8732 15.5552 66.9697 114.5244 90.1522 181.7132 70.2881 46.2158 18.8906 69.0001 23.3539 7.6313 11.4636 15.1753 25.4410 94.1808 27.3404 12.1048 27.2296 17.7412 13.1028 24.5323 29.9153 4.6155 29.0309 31.2629 29.6478 15.0642 15.5548 27.1623 0.7820 5.4925 3.8581 61.1460
temp: 298.150 k
press: 1.00000 atm
elementType: 8 8 8 8 8 8 7 7 6 6 6 6 6 6 6 6 6 6 6 6 6 6 6 6 6 6 6 6 1 1 1 1 1 1 1 1 1 1 1 1 1 1 1 1 1 1 1 1 1 1 1 1 1 1 1 1
symmnumber: 1
zpe: 1200276.3 jmol-1
zpe.correction: 0.457161 hartree
zpe.thermalcorrener: 0.487477 hartree
zpe.thermalcorrenthalpy: 0.488421 hartree
zpe.thermalcorrgfe: 0.392720 hartree
zpe.sumelectzpe: -1337.616157 hartree
zpe.sumelectthermal: -1337.585841 hartree
zpe.sumelectthermalent: -1337.584897 hartree
zpe.sumelectthermalfe: -1337.680599 hartree
dipole: -2.0929 -3.1455 0.0168
dipole: 3.7782
quadrupole: -126.4354 -147.7206 -173.7591
quadrupole: -10.3513 19.5409 2.9464
quadrupole: 22.8696 1.5844 -24.4540 -10.3513 19.5409 2.9464
hfenergy: -1338.0733182 hartree
pointgroup: C01 [X(C20H28N2O6)]
dipole: 0.8238552 -0.9795826 0.7558199 debye
polarizability: 334.6846686|38.668728|227.8832052|12.5221094|-37.3291903|212.531923 unknown
InChI: InChI=1S/C20H28N2O6/c1-3-27-19(25)17(20(26)28-4-2)11-14-13-21-18-6-5-15(12-16(14)18)22(7-9-23)8-10-24/h5-6,12-13,17,21,23-24H,3-4,7-11H2,1-2H3
charge 0 multiplicity 1
56 atoms
O  -4.593094 -0.694823 -0.607601
O  -0.92539 2.307806 -1.275695
O  3.481257 1.52925 -3.114955
O  5.388554 1.678674 1.759605
O  -4.645288 1.549106 0.010642
O  -1.708807 1.820895 0.869341
N  3.556912 -0.2434 0.258289
N  -1.270593 -2.77753 1.692626
C  -0.030305 -1.378891 0.373331
C  -1.391188 -1.417386 -0.143897
C  -1.909622 -0.704231 -1.368413
C  0.01573 -2.244884 1.518464
C  2.365729 -0.900105 0.659806
C  -2.645149 0.663094 -1.130087
C  1.14716 -0.711844 -0.051072
C  -2.109022 -2.279433 0.689505
C  1.211022 -2.449148 2.233624
C  2.369536 -1.776364 1.804731
C  3.517518 0.86049 -0.711889
C  4.839932 -0.517089 0.914009
C  -4.032283 0.581292 -0.48846
C  -1.755566 1.644369 -0.363367
C  3.646002 0.396971 -2.184353
C  5.102224 0.297459 2.195298
C  -6.002445 -0.836211 -0.120505
C  0.056407 3.270566 -0.686156
C  -6.997262 -0.432173 -1.211833
C  0.86317 3.84688 -1.845634
H  -1.068127 -0.490362 -2.053479
H  -2.616832 -1.349989 -1.916927
H  -2.812225 1.10743 -2.132486
H  1.106379 -0.071432 -0.937357
H  -3.157602 -2.56213 0.631871
H  -1.550709 -3.415493 2.433074
H  1.253953 -3.106293 3.109761
H  3.288282 -1.928045 2.377771
H  2.574872 1.429248 -0.603815
H  4.3365 1.561873 -0.466457
H  4.925901 -1.595321 1.144388
H  5.659318 -0.282052 0.208521
H  4.619449 -0.11336 -2.344283
H  2.839951 -0.30407 -2.451164
H  4.215274 0.26394 2.859251
H  5.978593 -0.126288 2.733087
H  -6.08159 -1.905314 0.135784
H  -6.121732 -0.214911 0.784087
H  -0.512293 4.042054 -0.135707
H  0.681405 2.722321 0.043292
H  4.217958 2.175442 -2.968282
H  5.361581 2.288565 2.537669
H  -6.90758 0.642237 -1.443132
H  -6.829665 -1.01445 -2.134446
H  -8.029675 -0.623911 -0.864887
H  1.428348 3.060763 -2.376668
H  0.200072 4.353473 -2.568097
H  1.584453 4.591431 -1.459321
