program: Gaussian 09
title: 000257233
version: EM64L-G09RevD.01
frameworkgroup: C1[X(C11H21NO5)]
method: RPBEPBE
basis: SDD
operation: Freq
keyword: #p
keyword: freq=noraman
keyword: PBEPBE/SDD
title: #p freq=noraman PBEPBE/SDD
converged: YES YES NO NO
title: Mulliken charges:
elementType: O O O O O N C C C C C C C C C C C H H H H H H H H H H H H H H H H H H H H H
charge: -0.292241 -0.225882 -0.239910 -0.264290 -0.201262 -0.426964 -0.174417 -0.400462 -0.393358 0.232040 0.218909 -0.710173 -0.703185 0.249142 -0.524266 -0.513018 -0.499669 0.199624 0.245967 0.202782 0.210813 0.214448 0.328842 0.221177 0.221944 0.207509 0.203538 0.219943 0.256341 0.254326 0.230074 0.228956 0.222953 0.235110 0.238975 0.254255 0.231672 0.239758
chargesum: 0.00000
title: Mulliken charges with hydrogens summed into heavy atoms:
elementType: O O O O O N C C C C C C C C C C C
charge: -0.292241 -0.225882 -0.239910 -0.264290 -0.201262 -0.098122 0.025207 0.048287 0.031902 0.232040 0.218909 -0.059542 -0.023363 0.249142 0.189089 0.184019 0.226016
polarizability: 1.65679256e+02 -3.35163421e+00 1.42942262e+02 1.05652259e+00 3.97063872e-01 1.21629721e+02
1716.lowfreq: -21.2339 -0.0010 -0.0004 0.0006 1.0225 10.1067 18.1499 25.6259 39.7984
frequency: 11.4549 25.3045 39.5520 68.3240 72.7182 88.8036 97.1940 104.8100 105.7342 112.5616 128.3557 143.6787 158.0018 171.1769 178.5697 195.9570 211.9379 221.1472 244.9742 276.1881 280.5842 297.5598 312.2344 329.1558 344.1927 357.3305 379.7029 454.6362 495.7471 552.7001 583.7516 670.5081 673.2033 705.9096 721.7701 744.0462 784.2551 791.5833 832.1806 874.1842 877.3497 914.2477 963.1765 981.3222 997.0487 1009.5808 1024.8092 1055.1451 1062.8686 1092.7473 1105.3719 1114.3676 1120.2957 1126.1392 1130.6261 1141.5547 1149.8228 1154.1577 1165.8411 1182.3804 1235.4187 1237.7509 1261.6851 1289.0620 1316.1239 1347.6188 1362.8442 1388.8068 1392.8519 1420.5932 1421.7509 1425.5299 1448.7238 1452.1658 1458.3978 1462.3496 1462.9672 1463.9434 1470.1905 1471.2536 1478.8658 1480.1801 1480.6976 1487.2145 1494.8858 1613.2542 1656.2101 2949.6963 2975.0847 2977.7513 2981.8053 2981.8699 2985.4656 2991.2260 3005.3532 3029.3669 3047.2650 3071.4324 3074.2483 3074.5988 3078.3252 3080.1280 3089.8923 3108.8789 3124.5361 3125.1437 3151.4927 3542.6386
redmass: 3.3295 4.7522 4.2454 3.7319 3.5783 2.2461 2.1925 1.5864 1.4423 2.0854 1.3868 1.5596 2.2243 2.7293 2.6398 2.3802 1.4752 2.2775 2.7021 2.3987 3.2504 2.5070 6.6631 4.1569 4.5856 4.4207 5.0184 7.2931 2.7246 1.1715 5.3990 3.3826 6.2486 5.8814 2.8018 3.3224 2.2031 1.6451 2.1500 2.9685 7.9965 1.8546 6.1377 7.9164 6.2539 1.4615 1.6926 2.4870 6.5764 1.6876 1.8989 1.2697 1.4421 1.5034 2.1494 1.9162 1.4878 1.8389 1.8326 2.0157 3.7481 1.3526 1.3129 1.2817 1.2791 1.3787 1.5764 1.2196 1.2094 1.1414 1.1825 1.2440 1.5962 1.0642 1.0556 1.0564 1.0580 1.0609 1.0688 1.0643 1.0570 1.0601 1.0584 1.0457 1.0684 7.1972 10.6876 1.0810 1.0366 1.0309 1.0318 1.0491 1.0494 1.0638 1.0294 1.1014 1.0966 1.0990 1.0991 1.1035 1.1001 1.1024 1.1004 1.1047 1.1036 1.1019 1.1049 1.0774
irintensity: 0.2544 0.9484 0.5287 1.3963 4.0586 3.7100 0.7155 0.7828 0.7520 4.4187 0.2989 0.9424 2.7254 6.4079 3.0960 7.0445 3.7941 10.4104 3.6713 2.1757 0.8405 1.9524 9.7843 18.6472 6.5068 2.8915 1.4878 1.7424 1.6662 68.1091 8.2628 6.2675 21.4746 14.7735 14.3372 7.8466 5.9238 27.2312 10.7587 17.2789 26.5340 7.7974 28.9806 59.3910 96.7789 1.0109 24.1663 14.1225 384.9757 1.5327 30.7493 0.6998 8.3406 20.8762 10.5984 9.1596 18.1485 6.8805 12.2456 2.6232 133.2209 13.6642 39.3356 4.6783 3.1360 1.6773 7.7749 17.7777 25.2791 3.8873 36.9064 49.3546 248.7868 49.7868 3.5637 4.8206 3.6743 15.5607 26.7098 18.1642 19.8600 8.6184 8.5250 5.8313 7.5322 117.0191 172.6514 24.8715 33.1557 55.4737 50.0590 48.0620 34.1969 9.7508 29.3125 27.1095 2.8017 32.7537 54.3138 59.7669 33.1645 34.1363 42.0095 21.3105 18.9100 18.2886 14.0634 34.2188
temp: 298.150 k
press: 1.00000 atm
elementType: 8 8 8 8 8 7 6 6 6 6 6 6 6 6 6 6 6 1 1 1 1 1 1 1 1 1 1 1 1 1 1 1 1 1 1 1 1 1
symmnumber: 1
zpe: 826249.1 jmol-1
zpe.correction: 0.314702 hartree
zpe.thermalcorrener: 0.336388 hartree
zpe.thermalcorrenthalpy: 0.337332 hartree
zpe.thermalcorrgfe: 0.262104 hartree
zpe.sumelectzpe: -861.234474 hartree
zpe.sumelectthermal: -861.212788 hartree
zpe.sumelectthermalent: -861.211843 hartree
zpe.sumelectthermalfe: -861.287072 hartree
dipole: -0.8780 -0.7402 4.1968
dipole: 4.3511
quadrupole: -98.6407 -86.3996 -110.6985
quadrupole: -1.4897 5.2531 0.4491
quadrupole: -0.0611 12.1800 -12.1189 -1.4897 5.2531 0.4491
hfenergy: -861.5491753 hartree
pointgroup: C01 [X(C11H21N1O5)]
dipole: -0.358976 0.2192409 -1.6593841 debye
polarizability: 165.4852569|3.8774459|143.1234101|-1.3807708|-0.4644981|121.6425713 unknown
InChI: InChI=1S/C11H21NO5/c1-6-8(7-2)9(13)12-11(16-4,17-5)10(14)15-3/h8,12H,6-7H2,1-5H3
charge 0 multiplicity 1
38 atoms
O  2.238581 0.744727 -1.480713
O  1.96261 1.512777 0.787452
O  -0.790578 0.022961 1.402482
O  1.093541 -1.815965 -0.175167
O  2.790682 -1.056987 1.227245
N  0.143346 0.696864 -0.615131
C  -2.305622 0.413864 -0.515385
C  -3.385062 0.973577 0.448178
C  -2.634745 -1.006066 -1.090226
C  -0.942211 0.365192 0.192687
C  1.529954 0.561153 -0.199446
C  -4.793322 1.05718 -0.176226
C  -2.894214 -2.092993 -0.024675
C  1.875809 -0.83056 0.414229
C  3.70953 0.673013 -1.374138
C  1.539635 2.901776 0.530547
C  1.332744 -3.190807 0.327064
H  -2.22551 1.102692 -1.384559
H  -3.401248 0.354358 1.362942
H  -3.069572 1.98448 0.774902
H  -1.79402 -1.324936 -1.738084
H  -3.519559 -0.91131 -1.749184
H  0.014572 0.891614 -1.610534
H  -5.50063 1.535092 0.525919
H  -5.194484 0.056793 -0.420102
H  -4.789396 1.655796 -1.107443
H  -3.056017 -3.073531 -0.509521
H  -3.791551 -1.86564 0.578563
H  -2.039773 -2.180879 0.668251
H  4.065475 1.251027 -0.503594
H  4.047779 -0.375726 -1.281115
H  4.086233 1.107256 -2.312619
H  1.769078 3.206702 -0.507686
H  0.460046 3.021996 0.730083
H  2.121349 3.505476 1.24291
H  1.118886 -3.233992 1.407867
H  0.63596 -3.821488 -0.241974
H  2.380109 -3.48749 0.148301
