program: Gaussian 09
title: 000023819
version: EM64L-G09RevD.01
frameworkgroup: C1[X(C8H20N6)]
method: RPBEPBE
basis: SDD
operation: Freq
keyword: #pfreq=noraman
keyword: PBEPBE/SDD
title: #p freq=noraman PBEPBE/SDD
converged: YES YES NO NO
title: Mulliken charges:
elementType: N N N N N N C C C C C C C C H H H H H H H H H H H H H H H H H H H H
charge: -0.115480 -0.115424 -0.656354 -0.669075 -0.656349 -0.669072 -0.358860 -0.358670 -0.396779 -0.396660 -0.456144 -0.456218 0.242314 0.242314 0.219967 0.170610 0.219858 0.170674 0.201959 0.179408 0.179274 0.201994 0.200215 0.180938 0.200166 0.180937 0.326206 0.292046 0.295794 0.343192 0.326205 0.292048 0.295789 0.343177
chargesum: 0.00000
title: Mulliken charges with hydrogens summed into heavy atoms:
elementType: N N N N N N C C C C C C C C
charge: -0.115480 -0.115424 -0.038103 -0.030089 -0.038096 -0.030106 0.031718 0.031862 -0.015411 -0.015393 -0.074990 -0.075115 0.242314 0.242314
polarizability: 1.88825150e+02 1.25082350e+01 1.25570360e+02 1.30500970e+01 -4.40455444e+00 9.16702704e+01
1716.lowfreq: -286.2506 -285.9088 -8.9950 -4.4557 -0.0005 0.0003 0.0006 7.0994 12.9369
frequency: -286.2505 -285.9088 12.9225 24.1958 32.2363 32.3000 59.9882 108.8558 109.7466 138.5042 166.7171 188.0469 192.5635 236.3410 258.7636 297.7920 322.4445 327.1314 334.9970 353.7909 354.1135 423.5304 445.0912 477.2314 483.4175 483.7467 511.6725 567.1920 569.7427 676.2050 676.4143 731.4782 757.5192 816.4730 862.9702 877.9650 883.8736 927.6116 954.5040 965.9932 994.0411 999.2517 1021.2541 1032.1404 1071.3491 1077.8608 1092.3643 1119.4277 1147.8535 1181.9983 1182.3589 1196.3103 1223.9334 1257.0757 1269.1925 1281.7749 1293.5158 1317.9778 1346.8433 1347.3534 1361.5014 1362.6044 1416.2798 1416.4429 1449.4244 1453.1743 1456.1238 1456.5607 1471.0154 1484.2605 1591.8003 1591.9135 1621.6779 1621.7746 1667.5241 1671.5964 2848.8253 2848.9877 2894.5146 2894.7793 2946.8420 2956.3588 2969.6745 2971.0750 3007.0646 3019.7933 3034.6007 3050.4680 3562.4986 3562.5506 3573.2978 3573.3365 3706.8555 3706.8691 3728.8527 3728.8961
redmass: 1.1840 1.1842 4.2474 4.2740 4.2100 3.5980 4.4986 1.6661 3.0748 2.7238 4.2906 2.6550 2.7030 2.2104 1.8120 2.4436 1.3442 1.2227 2.2629 1.3495 1.3612 2.7882 2.4358 2.6137 1.0625 1.0611 2.6336 3.1692 2.8992 8.0381 8.1343 1.1093 1.3796 2.1829 2.9900 2.1627 1.6163 2.3926 2.3544 1.6405 1.5658 1.5757 2.0967 2.4298 2.4490 2.1320 2.3362 1.9430 1.3484 2.3373 2.3438 1.2113 1.2980 1.2914 1.2272 1.0498 1.1554 1.3193 1.4496 1.4406 1.4741 1.5938 4.0917 4.0879 1.0841 1.0822 1.0900 1.0902 1.0765 1.0996 1.2557 1.2564 1.3213 1.3198 3.3556 3.4368 1.0564 1.0564 1.0991 1.0990 1.0648 1.0623 1.0618 1.0624 1.0910 1.0954 1.1031 1.1028 1.0453 1.0453 1.0447 1.0447 1.1032 1.1032 1.1052 1.1052
irintensity: 28.9757 34.5834 3.2618 9.3330 0.2377 5.5604 0.0006 0.0029 6.7445 8.0503 0.0002 3.8480 0.0011 17.0368 0.0001 34.1035 0.8735 1007.3459 0.0242 21.9651 4.5085 0.0004 5.0066 0.0005 3.1791 134.8172 6.6763 0.0002 19.6658 0.0172 29.4834 5.2921 0.0001 7.2061 0.0001 1.5751 0.0009 24.3199 0.0010 24.1665 0.0006 4.5573 0.6633 0.0001 0.0001 3.6070 0.0008 0.0005 9.7433 0.0023 16.0594 39.2323 0.0053 0.0005 2.8517 0.0018 1.3976 0.0043 54.9478 72.6333 23.6077 0.0141 3.9733 244.1085 16.7117 0.0012 59.6370 0.0004 0.0009 14.9940 116.5767 166.1379 136.9734 64.5587 1329.8077 0.0482 72.1757 103.5797 83.5953 57.1926 0.0008 41.6465 0.7519 162.1205 0.0005 23.8384 0.0031 141.6683 16.2781 28.5338 35.1153 22.3641 2.2309 39.5965 23.6938 32.6722
temp: 298.150 k
press: 1.00000 atm
elementType: 7 7 7 7 7 7 6 6 6 6 6 6 6 6 1 1 1 1 1 1 1 1 1 1 1 1 1 1 1 1 1 1 1 1
symmnumber: 1
zpe: 770262.1 jmol-1
zpe.correction: 0.293377 hartree
zpe.thermalcorrener: 0.310875 hartree
zpe.thermalcorrenthalpy: 0.311819 hartree
zpe.thermalcorrgfe: 0.244921 hartree
zpe.sumelectzpe: -644.209465 hartree
zpe.sumelectthermal: -644.191967 hartree
zpe.sumelectthermalent: -644.191023 hartree
zpe.sumelectthermalfe: -644.257921 hartree
dipole: 0.0084 0.0217 -0.0099
dipole: 0.0253
quadrupole: -18.1878 -74.9190 -91.6250
quadrupole: -0.5559 15.1121 -4.1350
quadrupole: 43.3895 -13.3417 -30.0477 -0.5559 15.1121 -4.1350
hfenergy: -644.5028424 hartree
pointgroup: C01 [X(C8H20N6)]
dipole: 0.0033622 -0.0083006 0.0043476 debye
polarizability: 188.7648503|-13.0898877|124.8802906|-12.8096795|-6.2815885|92.4206387 unknown
InChI: InChI=1S/C8H20N6/c9-7(10)13-5-3-1-2-4-6-14-8(11)12/h1-6,9-12H2
charge 0 multiplicity 1
34 atoms
N  3.697164 -0.09478 0.3723
N  -3.704552 0.097146 -0.356985
N  5.605193 -1.441226 0.2509
N  5.745398 0.756376 -0.603695
N  -5.615395 1.437462 -0.213799
N  -5.745274 -0.767735 0.622653
C  0.726793 0.078165 -0.244578
C  -0.730726 -0.071304 0.242339
C  1.541666 1.094319 0.582693
C  -1.546685 -1.084273 -0.587715
C  3.014528 1.192892 0.132515
C  -3.017035 -1.19041 -0.131183
C  4.952452 -0.226936 0.01313
C  -4.958228 0.222899 0.009985
H  1.249763 -0.897322 -0.202686
H  0.725354 0.392486 -1.310866
H  -1.253056 0.904651 0.204185
H  -0.728949 -0.389045 1.307609
H  1.526757 0.797567 1.650019
H  1.070483 2.097144 0.511908
H  -1.072355 -2.086214 -0.525561
H  -1.537624 -0.780597 -1.653153
H  3.505041 2.02513 0.694443
H  3.030526 1.480603 -0.949511
H  -3.50802 -2.019397 -0.697531
H  -3.026735 -1.48714 0.948494
H  5.054786 -2.168787 0.696879
H  6.572494 -1.613783 -0.000688
H  6.71019 0.5942 -0.878383
H  5.330683 1.657772 -0.81657
H  -5.069327 2.170222 -0.656589
H  -6.582663 1.604342 0.041722
H  -6.708566 -0.610002 0.905081
H  -5.327082 -1.669823 0.825538
