program: Gaussian 09
title: 000257232
version: EM64L-G09RevD.01
frameworkgroup: C1[X(C11H12N2O)]
method: RPBEPBE
basis: SDD
operation: Freq
keyword: #p
keyword: freq=noraman
keyword: PBEPBE/SDD
title: #p freq=noraman PBEPBE/SDD
converged: NO YES NO NO
title: Mulliken charges:
elementType: O N N C C C C C C C C C C C H H H H H H H H H H H H
charge: -0.229929 -0.617909 -0.002733 0.092596 -0.410903 0.345902 0.186566 -0.712480 -0.349166 -0.409146 -0.232327 -0.237840 -0.244909 -0.235198 0.233824 0.208113 0.210847 0.255220 0.244697 0.258430 0.253629 0.234984 0.233046 0.235865 0.352034 0.336788
chargesum: 0.00000
title: Mulliken charges with hydrogens summed into heavy atoms:
elementType: O N N C C C C C C C C C C C
charge: -0.229929 0.070912 -0.002733 0.092596 0.031034 0.345902 0.186566 -0.001715 -0.090736 -0.155517 -0.232327 -0.002856 -0.011864 0.000667
polarizability: 1.61173749e+02 -8.14770976e+00 1.21250927e+02 9.91848010e-01 1.07181799e+01 9.53594065e+01
1716.lowfreq: -15.7760 -8.4650 -2.9554 -0.0004 0.0003 0.0004 16.8427 48.6248 86.9871
frequency: 14.1928 48.5388 86.9706 100.0812 127.4300 146.0721 180.7634 182.8223 246.9888 274.8946 317.4800 352.1840 363.4027 400.8800 429.5507 451.9253 529.7065 542.1811 567.4726 603.7788 616.1058 624.0143 661.8198 704.7688 720.8601 758.6926 788.9241 857.5630 882.8708 920.0577 939.7506 975.9605 982.9563 990.4719 1001.6381 1030.7651 1056.7534 1065.9017 1088.4513 1108.7275 1145.7140 1176.8214 1197.2183 1202.7651 1276.3039 1302.8261 1322.7295 1328.7224 1377.1259 1404.9167 1434.8148 1465.3845 1470.6392 1483.3814 1487.8787 1580.7915 1588.2619 1608.8001 1647.3150 2196.9302 2988.3692 2994.4981 3048.8602 3085.9789 3104.2805 3129.6599 3135.6060 3147.8361 3159.0540 3170.6003 3506.2244 3658.8080
redmass: 4.6203 4.3145 4.0836 2.3870 7.4736 5.2351 2.3450 2.7388 1.9924 2.8116 4.8127 4.8900 4.7890 2.8232 4.0432 7.1163 3.8755 2.1606 1.2656 1.7002 6.3234 3.1296 5.7534 1.8825 4.1302 1.7782 1.3624 1.2508 2.3592 2.5737 2.0068 1.9138 1.3911 6.1096 1.3242 2.2770 2.5806 2.2112 2.1137 1.8946 2.2615 1.0520 1.6334 1.8497 1.3081 2.1690 1.4722 1.5045 6.5466 1.2014 2.2187 1.0983 1.0408 2.0578 1.0546 1.3759 5.8682 5.9252 4.3748 12.6529 1.0563 1.0391 1.1031 1.0995 1.1005 1.0853 1.0884 1.0927 1.0950 1.1010 1.0448 1.1044
irintensity: 3.1976 4.6463 0.9245 0.1292 1.3705 3.1762 0.2212 2.1310 1.7516 2.3019 3.2885 2.2104 5.7806 0.2809 4.4510 2.4315 11.6533 1.0189 103.1077 98.8745 1.0017 24.6776 3.6314 50.5386 23.5891 25.0913 29.7374 0.5984 0.2302 1.7410 4.9803 8.3072 0.2239 1.3166 0.1033 6.7832 2.9900 2.5471 3.1417 10.0573 3.6339 0.0818 3.3273 9.7565 29.7217 79.0534 19.6402 14.1574 0.9736 23.9291 10.4215 10.7373 12.1898 21.4162 10.9013 106.0327 3.3962 15.0751 256.1280 4.9587 30.0449 21.3957 10.6609 26.2046 18.8025 1.2484 1.5264 13.7668 25.3955 14.8603 34.0727 62.9046
temp: 298.150 k
press: 1.00000 atm
elementType: 8 7 7 6 6 6 6 6 6 6 6 6 6 6 1 1 1 1 1 1 1 1 1 1 1 1
symmnumber: 1
zpe: 541749.7 jmol-1
zpe.correction: 0.206342 hartree
zpe.thermalcorrener: 0.220068 hartree
zpe.thermalcorrenthalpy: 0.221012 hartree
zpe.thermalcorrgfe: 0.164772 hartree
zpe.sumelectzpe: -610.078645 hartree
zpe.sumelectthermal: -610.064919 hartree
zpe.sumelectthermalent: -610.063975 hartree
zpe.sumelectthermalfe: -610.120215 hartree
dipole: 4.9640 -5.1648 -0.1783
dipole: 7.1657
quadrupole: -84.9993 -85.7473 -79.9933
quadrupole: 7.0293 6.5118 1.3608
quadrupole: -1.4193 -2.1674 3.5867 7.0293 6.5118 1.3608
hfenergy: -610.2849869 hartree
pointgroup: C01 [X(C11H12N2O1)]
dipole: 2.0094499 -1.9097078 0.5129659 debye
dipolederiv: -1.020747 0.2152029 0.0560574 0.1983706 -0.4017326 0.0417656 0.3227675 -0.0129761 -0.6201389 -0.6128054 0.0837765 -0.2123869 0.1386323 -0.7149301 0.1802289 -0.3044348 0.2225708 -0.7317303 -0.2179602 -0.0075985 -0.0092389 0.0131086 -0.2395071 0.0285434 -0.0339975 0.0219693 -0.2271327 0.0551471 -0.0215946 0.1035759 -0.0263412 0.1061515 -0.0323286 0.2171037 -0.0118204 -0.1128126 0.0372148 0.0674164 0.0615492 0.0895002 0.1405173 0.1007341 0.0140443 0.0802348 0.1169405 0.3572633 -0.008776 -0.0787044 0.0036113 -0.079967 0.0321892 -0.0445606 0.0314131 -0.1286513 1.182205 -0.4174595 -0.0128634 -0.4572734 0.4172907 -0.3487971 -0.1747075 -0.3241279 1.1911424 -0.0755783 0.0062294 -0.0158907 -0.0572391 0.0451219 -0.0203752 -0.0369377 -0.0147217 0.0229365 -0.1762653 -0.0900775 -0.0179872 -0.0802754 0.014557 0.0445709 -0.0011615 0.0148065 -0.1025727 -0.1512828 0.0588942 0.0361633 0.0240302 -0.0095331 0.0405788 0.0380067 0.0793282 -0.151522 -0.0702965 -0.038531 0.0413679 -0.0441941 0.0978379 -0.0921932 0.0121531 -0.0870752 -0.018228 0.0085613 0.0838504 0.0252721 0.0750569 0.0861365 0.0678746 0.0259107 0.062317 -0.1160702 0.0060792 -0.071006 -0.0342953 -0.1002698 0.0675685 0.0518241 -0.0256887 0.0618073 -0.1230528 0.0851579 -0.0016609 0.0192499 0.014937 -0.0826821 0.0250054 0.008243 0.0162167 -0.1468369 -0.0123364 -0.0094409 0.0750321 -0.0253113 0.0583401 -0.0259548 0.1019583 -0.0118501 -0.0824346 0.0317189 0.0613797 -0.0437179 0.0776638 -0.0975738 0.0647123 -0.0616401 0.0566927 0.0284184 0.0236547 -0.0536655 -0.049766 -0.0942473 -0.0695154 -0.1259267 -0.0819562 -0.1177402 0.0132841 0.0489684 -0.0038815 0.0619736 0.0324108 0.10446 0.027138 0.1180135 0.0332258 -0.030827 0.0601405 0.0206019 -0.0153454 0.075479 -0.0395701 0.1058415 -0.0185762 0.0823995 0.0523363 0.0610172 0.0745431 0.0230231 0.0737162 0.0130137 -0.0301936 0.0238056 -0.0309383 0.1324805 0.0862292 -0.0824902 -0.0231079 -0.0893946 -0.0219995 -0.0526675 -0.0342545 -0.0475505 0.1194091 0.0256345 -0.0703802 -0.0257928 -0.0878681 -0.042203 -0.0593199 -0.0353338 -0.0571108 0.1362378 0.0145232 0.0806099 0.0183305 0.0989148 -0.0431642 -0.0557409 0.0240372 -0.0556977 0.140763 -0.1248269 -0.0016865 -0.0116931 -0.0030204 0.0977226 -0.0179471 -0.0129803 -0.0164087 0.154713 0.2063678 0.0668006 0.0019909 0.0809265 0.277575 0.0079841 -0.076043 -0.0165875 0.2752984 0.1722161 0.0589437 0.0272041 0.0690765 0.3160854 0.0424538 0.036229 0.0416234 0.2080499 unknown
polarizability: 161.5300898|-6.4073246|124.491369|4.0556398|2.3689267|91.7626232 unknown
InChI: InChI=1S/C11H12N2O/c1-2-11(8-12,10(13)14)9-6-4-3-5-7-9/h3-7H,2,13H2,1H3
charge 0 multiplicity 1
26 atoms
O  -2.622721 0.084735 1.660983
N  -0.665337 -1.041102 2.193208
N  -1.775195 2.207017 -1.081769
C  -0.89285 -0.125344 -0.120204
C  -1.489551 -1.284188 -1.015199
C  0.656631 -0.109272 -0.120345
C  -1.474328 -0.321714 1.338176
C  -3.014175 -1.222964 -1.228026
C  1.345992 1.076177 0.249873
C  1.416103 -1.26833 -0.425254
C  -1.38985 1.171271 -0.635236
C  2.754631 1.102902 0.313391
C  2.829105 -1.241807 -0.360553
C  3.504355 -0.058287 0.010963
H  -0.9725 -1.244424 -1.992733
H  -1.223654 -2.246936 -0.538625
H  -3.337068 -2.086567 -1.837202
H  -3.561902 -1.244473 -0.271347
H  -3.308828 -0.301263 -1.75954
H  0.776535 1.984966 0.476251
H  0.919747 -2.194157 -0.73145
H  3.266783 2.02949 0.594413
H  3.398152 -2.145101 -0.606904
H  4.598542 -0.037326 0.056895
H  0.294428 -1.284221 1.949404
H  -1.017847 -1.24448 3.128428
