program: Gaussian 09
title: 000257221
version: EM64L-G09RevD.01
frameworkgroup: C1[X(C15H17NO3)]
method: RPBEPBE
basis: SDD
operation: Freq
keyword: #p
keyword: freq=noraman
keyword: PBEPBE/SDD
title: #p freq=noraman PBEPBE/SDD
converged: YES YES NO NO
title: Mulliken charges:
elementType: O O O N C C C C C C C C C C C C C C C H H H H H H H H H H H H H H H H H
charge: -0.258810 -0.217370 -0.218267 -0.413096 0.129184 0.514148 -0.698659 -0.748278 -0.699013 -0.432779 -0.416513 0.382255 -0.410783 -0.428697 0.029193 0.054604 0.124032 0.128091 -0.490728 0.208308 0.223258 0.218589 0.217007 0.216596 0.218264 0.208281 0.218196 0.223419 0.246749 0.227933 0.279088 0.286212 0.348904 0.249281 0.249198 0.232202
chargesum: 0.00000
title: Mulliken charges with hydrogens summed into heavy atoms:
elementType: O O O N C C C C C C C C C C C C C C C
charge: -0.258810 -0.217370 -0.218267 -0.064192 0.129184 0.514148 -0.048504 -0.096410 -0.049117 -0.186030 -0.188580 0.382255 -0.131695 -0.142485 0.029193 0.054604 0.124032 0.128091 0.239953
polarizability: 3.22497574e+02 -2.15843350e+01 1.91688431e+02 6.56383239e-02 -1.19656439e-01 9.93283331e+01
1716.lowfreq: -12.6247 -7.5917 -2.3632 -0.0002 0.0003 0.0006 16.0186 42.2092 54.4057
frequency: 14.8304 42.1828 54.3981 63.5514 92.2693 101.5549 154.0311 155.5229 177.4779 178.0408 203.8004 214.4182 239.3866 243.1641 281.1101 302.9011 304.3322 333.1510 351.4363 359.2129 375.1700 400.3155 404.3219 409.8677 457.4699 517.0097 528.1277 574.4517 578.2210 582.3181 630.7679 635.7544 690.4596 716.3898 721.1961 741.9821 769.8284 827.2113 837.7837 854.1171 859.8155 918.3298 928.9689 930.4574 941.7626 980.9520 992.7077 998.0769 1011.5738 1020.4937 1023.5424 1091.9703 1104.7910 1114.2988 1134.3880 1142.8568 1203.5499 1204.1933 1215.0629 1223.4010 1274.3445 1294.2320 1303.0321 1315.5321 1335.5257 1361.4881 1374.5258 1376.8114 1404.3426 1419.3439 1439.9509 1453.2478 1453.8905 1459.1953 1463.5484 1465.8651 1478.2820 1487.3395 1493.9130 1505.4067 1549.7411 1604.8331 1617.6132 1640.4909 1663.6304 2973.1180 2974.5549 2979.6750 3010.3197 3068.6813 3069.1987 3070.6976 3077.6788 3079.9393 3083.7071 3122.0870 3127.3433 3144.4089 3150.8289 3171.5880 3183.1667 3589.8288
redmass: 3.1640 5.1661 3.2935 4.5750 4.9164 3.5885 11.0253 1.3605 1.4046 3.7341 1.7577 2.9889 1.6999 2.1358 4.1103 2.7406 1.1204 3.9194 2.7370 5.1283 5.1316 4.4780 3.1656 3.4722 2.9951 5.6219 4.0922 1.2507 2.1467 5.3193 9.1098 7.3534 4.4976 5.8935 10.5825 5.6696 5.0963 3.9074 3.9896 1.2822 1.6334 1.7417 1.6750 8.1297 1.2010 1.3474 1.3599 4.3078 2.7950 1.5201 1.3875 4.4864 1.2426 2.3685 1.8090 1.4956 2.9508 2.6323 2.3577 1.3539 3.0675 4.4374 2.1715 1.6329 2.5759 5.0306 1.1848 1.2286 1.2024 3.3082 1.2269 1.0613 1.0511 1.0508 1.0484 1.0640 1.0778 1.0500 1.1270 2.0653 6.2278 9.7569 5.9502 7.4191 12.2196 1.0351 1.0346 1.0357 1.0282 1.0999 1.1002 1.1003 1.0986 1.0996 1.0989 1.1055 1.0890 1.1064 1.0883 1.0943 1.0945 1.0805
irintensity: 1.1613 0.0687 2.1568 1.9947 0.6929 1.6221 5.2949 0.1416 0.7460 0.6325 0.3423 0.0872 1.8725 1.5542 0.4429 1.0800 0.1102 3.3652 0.0005 4.2912 10.6831 2.7092 0.9531 1.6579 0.2335 8.2481 3.8086 136.8297 1.8359 2.4864 10.6946 0.3633 10.9890 1.6375 15.1135 1.8456 0.0833 42.5045 5.5392 7.0376 56.3014 4.4551 4.3901 26.4940 0.5051 1.7304 1.0738 1.2016 8.8748 7.2826 0.3651 27.5278 0.0161 28.9304 13.9341 2.6053 6.1174 76.5740 3.4639 31.3629 84.3608 365.6090 81.6744 103.0251 137.1243 49.3466 18.7509 24.6584 8.5913 13.2743 37.5631 51.8788 15.9370 0.0703 0.7846 2.7267 9.8833 11.7343 12.0742 44.5117 0.5546 90.7969 118.6676 526.5172 97.9983 29.0629 33.5168 44.8442 49.6405 1.3893 0.7937 26.6765 136.9511 28.2619 50.2934 21.1213 25.4157 16.1065 11.5092 8.2855 5.5465 111.4736
temp: 298.150 k
press: 1.00000 atm
elementType: 8 8 8 7 6 6 6 6 6 6 6 6 6 6 6 6 6 6 6 1 1 1 1 1 1 1 1 1 1 1 1 1 1 1 1 1
symmnumber: 1
zpe: 755284.3 jmol-1
zpe.correction: 0.287673 hartree
zpe.thermalcorrener: 0.306560 hartree
zpe.thermalcorrenthalpy: 0.307504 hartree
zpe.thermalcorrgfe: 0.239798 hartree
zpe.sumelectzpe: -860.834977 hartree
zpe.sumelectthermal: -860.816089 hartree
zpe.sumelectthermalent: -860.815145 hartree
zpe.sumelectthermalfe: -860.882851 hartree
dipole: 0.8230 2.6036 0.0013
dipole: 2.7306
quadrupole: -105.2640 -107.5244 -114.5223
quadrupole: -2.9179 -0.0185 -0.0409
quadrupole: 3.8396 1.5792 -5.4187 -2.9179 -0.0185 -0.0409
hfenergy: -861.1226494 hartree
pointgroup: C01 [X(C15H17N1O3)]
dipole: -0.3549559 -1.0001896 -0.1665721 debye
polarizability: 320.8809538|-24.0894667|190.0136949|-10.4691156|16.8324242|102.6196898 unknown
InChI: InChI=1S/C15H17NO3/c1-15(2,3)10-7-5-9(6-8-10)11-12(19-4)14(18)16-13(11)17/h5-8,16H,1-4H3
charge 0 multiplicity 1
36 atoms
O  2.286552 -1.93728 -0.49553
O  1.872268 2.822879 0.350272
O  5.044533 -0.5513 -0.332718
N  3.697901 1.367029 0.04261
C  -4.317508 -0.1309 0.002668
C  -2.775711 -0.031456 -0.019989
C  -4.842852 0.326352 1.398141
C  -4.82185 -1.573546 -0.258395
C  -4.909059 0.800978 -1.098703
C  -1.931315 -1.148693 -0.248865
C  -2.139192 1.223579 0.19345
C  0.103907 0.233957 -0.052382
C  -0.528073 -1.027312 -0.265974
C  -0.741782 1.362921 0.179468
C  1.564543 0.366315 -0.070988
C  2.53922 -0.607466 -0.270237
C  2.305989 1.663692 0.134337
C  3.922119 0.004169 -0.202035
C  3.403577 -2.89772 -0.694372
H  -5.947785 0.28078 1.421371
H  -4.451328 -0.326588 2.199378
H  -4.540743 1.363427 1.628593
H  -4.50918 -1.944308 -1.252149
H  -4.456164 -2.281048 0.508667
H  -5.926692 -1.59085 -0.22883
H  -6.014161 0.754105 -1.083598
H  -4.611839 1.853676 -0.946176
H  -4.562152 0.493737 -2.102169
H  -2.368961 -2.136956 -0.418622
H  -2.748573 2.116784 0.373979
H  0.087926 -1.911177 -0.445835
H  -0.288757 2.343627 0.34605
H  4.433205 2.066757 0.142899
H  4.054094 -2.926111 0.194138
H  4.001748 -2.620699 -1.57699
H  2.896795 -3.861751 -0.845764
