program: Gaussian 09
title: 000253335
version: EM64L-G09RevD.01
frameworkgroup: C1[X(C19H18O5)]
method: RPBEPBE
basis: SDD
operation: Freq
keyword: #pfreq=noraman
keyword: PBEPBE/SDD
title: #p freq=noraman PBEPBE/SDD
converged: YES YES NO NO
title: Mulliken charges:
elementType: O O O O O C C C C C C C C C C C C C C C C C C C H H H H H H H H H H H H H H H H H H
charge: -0.298499 -0.258102 -0.271984 -0.246564 -0.201859 0.139446 0.310744 0.316265 -0.344128 0.066409 -0.477639 0.345653 -0.379687 -0.256504 0.204276 -0.260645 -0.365645 -0.369818 -0.268239 -0.230042 0.237367 -0.535381 -0.534073 -0.752327 0.277395 0.290828 0.246687 0.301604 0.217058 0.231396 0.242442 0.231783 0.228986 0.224879 0.226018 0.248736 0.222918 0.224011 0.251985 0.255959 0.245517 0.262774
chargesum: 0.00000
title: Mulliken charges with hydrogens summed into heavy atoms:
elementType: O O O O O C C C C C C C C C C C C C C C C C C C
charge: -0.298499 -0.258102 -0.271984 -0.246564 -0.201859 0.139446 0.310744 0.316265 -0.066734 0.066409 -0.186811 0.345653 -0.133000 0.045100 0.204276 -0.043587 -0.134249 -0.127376 -0.036457 -0.001056 0.237367 0.164253 0.164841 0.011922
polarizability: 4.38397561e+02 2.48600254e+01 2.41666689e+02 1.08184338e+01 -1.53716452e+01 1.24335534e+02
1716.lowfreq: -4.1417 -3.3868 -0.0005 0.0003 0.0005 4.0244 14.6855 18.1359 20.1339
frequency: 14.2671 18.1315 20.0572 37.7195 66.6217 68.3129 78.6581 90.6953 97.3746 100.1559 105.5936 123.7524 146.7436 180.0141 184.1986 221.8405 232.7044 242.6501 245.8721 258.2864 263.5365 300.3183 307.5996 317.1432 346.7547 362.6538 432.0805 453.4722 467.0550 494.4396 523.7117 534.3057 539.7757 548.9576 558.8486 569.9285 594.8125 618.0543 658.4327 669.1980 705.6617 731.0485 737.1964 756.2144 763.9192 795.8153 815.9682 823.7740 852.8186 870.5149 878.7631 885.2281 919.2205 939.6842 964.3317 976.7366 987.0628 988.2554 1006.1688 1017.1665 1033.8172 1039.6706 1046.1746 1095.8784 1105.0538 1111.4030 1112.3935 1138.4929 1151.1570 1161.3470 1172.3086 1176.1176 1205.2714 1215.0227 1231.1346 1235.7958 1270.7911 1292.3166 1299.9910 1327.5785 1372.3233 1385.6972 1385.9406 1425.4511 1430.5045 1435.2006 1449.6084 1452.0277 1452.9182 1466.3106 1467.8165 1469.6829 1471.7191 1482.8495 1486.7805 1512.6006 1568.5003 1578.5431 1603.7209 1612.8123 1629.3825 1672.3638 2964.1082 2966.5313 3006.4888 3054.5856 3057.6599 3092.9849 3130.4829 3130.7600 3131.3456 3139.8205 3140.4304 3143.4349 3152.0668 3158.9870 3161.6953 3171.9720 3173.6889 3200.2815
redmass: 4.8516 6.1170 8.9638 4.6885 3.3783 4.0316 4.6155 4.0713 1.6963 3.3025 1.7383 5.2310 4.9819 3.3720 2.5191 1.2683 3.7733 2.1935 2.6447 3.6317 3.7418 3.7100 3.6902 4.6406 6.0863 4.9464 4.7124 3.1372 3.1049 5.4104 4.9530 4.4176 4.2419 3.2665 4.5012 6.3831 6.1026 4.4137 6.5096 3.5732 5.7576 3.9120 4.4317 1.3616 3.0937 5.5799 2.4555 2.4580 1.4829 1.9079 3.3796 2.1171 5.8370 1.3849 1.3848 1.3368 8.1505 2.3053 3.3883 1.2451 3.9336 1.6402 2.2474 2.7469 2.0901 1.2596 1.2583 1.5014 1.3640 2.1292 1.6641 1.1489 1.7059 1.7096 3.0996 3.2247 1.6119 1.7143 1.5011 2.0714 6.0398 4.0664 1.4306 4.3370 1.4228 1.2049 1.7760 1.0508 1.0574 1.2468 1.0512 1.0533 1.0795 1.8501 2.7201 9.8592 8.4026 6.6134 6.0561 6.4535 5.7367 10.0098 1.0328 1.0326 1.0370 1.1042 1.1043 1.0970 1.0963 1.0999 1.0885 1.0911 1.0894 1.1013 1.0881 1.0931 1.0894 1.0993 1.0956 1.0928
irintensity: 0.3249 2.2195 0.7357 0.5268 7.5733 2.9554 1.5388 2.3044 1.5700 7.1703 0.5476 2.4161 0.1887 3.9027 2.3312 0.3902 4.1439 1.2270 1.5696 2.6025 6.3649 0.1574 5.0469 3.9230 1.4450 0.6473 5.0431 1.3851 9.2050 22.0351 8.2291 3.2316 2.8569 3.0683 8.1693 54.6319 2.5862 5.5954 17.4307 6.2399 2.7169 4.3258 3.2122 79.8923 19.4963 18.5780 39.0897 28.9179 0.6993 26.4524 9.6738 15.2622 11.2408 0.5813 4.4668 1.2131 32.9206 64.6420 145.1746 23.3690 65.5451 6.9946 4.3492 158.3163 237.0785 0.5502 0.1106 23.5528 3.9846 250.7386 70.8592 36.0516 5.4424 22.0436 413.1423 263.6143 37.9075 8.2219 142.3992 134.6109 26.5620 125.5210 100.4336 13.9689 27.7734 4.1704 14.0496 14.7501 17.9477 71.0797 15.4877 15.1400 60.2504 12.0839 27.1772 197.2028 58.7726 6.2284 69.9185 625.9209 98.2135 220.2709 90.8929 79.0647 0.8249 43.4237 43.0951 4.5696 14.0573 23.6630 4.3653 3.7975 7.9129 8.3137 0.8183 13.1500 20.4925 29.4634 14.2677 0.5219
temp: 298.150 k
press: 1.00000 atm
elementType: 8 8 8 8 8 6 6 6 6 6 6 6 6 6 6 6 6 6 6 6 6 6 6 6 1 1 1 1 1 1 1 1 1 1 1 1 1 1 1 1 1 1
symmnumber: 1
zpe: 847686.2 jmol-1
zpe.correction: 0.322867 hartree
zpe.thermalcorrener: 0.346572 hartree
zpe.thermalcorrenthalpy: 0.347516 hartree
zpe.thermalcorrgfe: 0.266106 hartree
zpe.sumelectzpe: -1109.177252 hartree
zpe.sumelectthermal: -1109.153547 hartree
zpe.sumelectthermalent: -1109.152602 hartree
zpe.sumelectthermalfe: -1109.234012 hartree
dipole: 2.2020 0.6571 0.4019
dipole: 2.3329
quadrupole: -81.2472 -140.3877 -140.8082
quadrupole: 12.1533 5.7882 5.6752
quadrupole: 39.5672 -19.5733 -19.9938 12.1533 5.7882 5.6752
hfenergy: -1109.5001182 hartree
pointgroup: C01 [X(C19H18O5)]
dipole: -0.8456583 -0.3225543 -0.1523756 debye
polarizability: 432.9778609|48.8343445|136.0230617|9.3606743|28.8762256|235.398862 unknown
InChI: InChI=1S/C19H18O5/c1-13(20)24-19-12-15(22-2)9-10-16(19)17(21)11-8-14-6-4-5-7-18(14)23-3/h4-12H,1-3H3
charge 0 multiplicity 1
42 atoms
O  1.576659 -1.139621 -0.96739
O  6.023072 0.684242 -0.492614
O  -4.317613 -0.289853 1.89732
O  0.333658 0.719725 2.518535
O  2.235825 -0.753083 -3.198027
C  1.973202 0.510017 0.776838
C  2.471486 -0.212206 -0.347459
C  -3.039569 0.034324 -0.108799
C  2.912049 1.28489 1.50608
C  0.552548 0.50349 1.278269
C  3.815817 -0.140826 -0.744997
C  4.711521 0.674048 -0.011285
C  4.26273 1.388509 1.129941
C  -1.854216 0.184867 0.739078
C  -4.317856 -0.210661 0.500586
C  -0.558047 0.32791 0.312036
C  -2.997941 0.124407 -1.529002
C  -5.48458 -0.362254 -0.287511
C  -4.153386 -0.025398 -2.318852
C  -5.398523 -0.270921 -1.693399
C  1.548816 -1.376871 -2.368894
C  7.010885 1.492632 0.230677
C  -5.593031 -0.518499 2.581326
C  0.555641 -2.480897 -2.650028
H  2.538846 1.81003 2.391173
H  4.19143 -0.699252 -1.603634
H  4.943259 2.012667 1.715098
H  -2.021184 0.171854 1.822929
H  -0.298592 0.324439 -0.750173
H  -2.03981 0.333405 -2.017364
H  -6.454558 -0.550077 0.18146
H  -4.08977 0.054486 -3.408762
H  -6.304949 -0.388057 -2.297544
H  7.125715 1.145347 1.27533
H  6.735378 2.564525 0.220361
H  7.953316 1.345811 -0.316212
H  -6.034371 -1.4917 2.292185
H  -6.312275 0.296492 2.371831
H  -5.342254 -0.527562 3.651752
H  0.903846 -3.42249 -2.189958
H  0.449316 -2.617272 -3.735703
H  -0.422286 -2.244121 -2.196602
