program: Gaussian 09
title: 000253293
version: EM64L-G09RevD.01
frameworkgroup: C1[X(C18H27NO5)]
method: RPBEPBE
basis: SDD
operation: Freq
keyword: #p
keyword: freq=noraman
keyword: PBEPBE/SDD
title: #p freq=noraman PBEPBE/SDD
converged: NO YES NO NO
title: Mulliken charges:
elementType: O O O O O N C C C C C C C C C C C C C C C C C C H H H H H H H H H H H H H H H H H H H H H H H H H H H
charge: -0.298477 -0.255103 -0.478998 -0.244025 -0.264986 -0.069317 -0.139464 -0.079122 -0.073187 -0.487683 -0.485416 -0.400341 -0.523109 -0.407229 0.225164 0.143747 -0.098568 0.167166 -0.547440 0.300104 -0.754571 -0.763620 -0.253643 -0.760237 0.269526 0.284343 0.278564 0.221893 0.221149 0.229992 0.231754 0.205599 0.231849 0.246059 0.218206 0.236484 0.240563 0.269471 0.217952 0.230780 0.257247 0.221383 0.230512 0.218039 0.237274 0.227373 0.231556 0.360820 0.242304 0.268782 0.218880
chargesum: 0.00000
title: Mulliken charges with hydrogens summed into heavy atoms:
elementType: O O O O O N C C C C C C C C C C C C C C C C C C
charge: -0.298477 -0.255103 -0.118177 -0.244025 -0.264986 -0.069317 0.130062 0.205221 0.205377 -0.044640 -0.023670 0.037107 -0.058844 0.069818 0.225164 0.143747 0.170902 0.167166 -0.098707 0.300104 -0.045430 -0.080934 -0.022086 -0.030270
polarizability: 2.47737563e+02 4.72971317e+00 1.88652932e+02 -3.52783579e+00 8.37467561e+00 1.95605266e+02
1716.lowfreq: -19.8882 -8.2162 -3.6779 0.0002 0.0005 0.0007 23.9045 37.9671 51.3478
frequency: 22.8777 37.6828 51.2415 64.7660 67.0536 77.7822 88.3429 101.2120 115.7747 134.4094 154.7716 163.3479 186.2732 197.9288 213.2265 230.5672 233.8435 250.8335 261.5086 285.2198 293.5520 306.6888 315.5927 323.1940 344.8262 353.9490 366.2348 378.7828 399.2259 405.7010 419.1315 431.9288 497.8127 510.2690 521.1676 553.9257 568.1726 577.2958 609.3032 632.8038 636.2197 652.7716 702.8791 726.2822 749.7997 785.5794 795.4829 817.9271 835.9495 847.0255 860.2038 881.2681 884.9426 896.5404 904.7065 908.6292 912.3398 938.3225 959.7180 970.2861 988.4327 1006.8205 1013.7483 1020.1809 1022.6697 1042.4323 1046.9265 1060.4968 1061.2849 1067.9135 1083.3279 1097.6358 1097.9673 1103.2798 1118.5569 1127.9950 1142.4869 1147.1475 1165.8176 1180.2923 1193.0239 1210.1597 1220.3444 1225.8885 1238.6147 1244.7481 1259.6437 1269.5561 1282.2243 1291.9246 1293.9479 1298.8130 1314.8016 1320.8514 1323.1714 1327.6898 1330.9427 1344.3556 1357.4908 1360.7376 1374.1686 1379.0647 1383.1596 1387.3580 1390.3527 1442.9156 1445.9312 1454.7404 1460.7226 1465.7348 1467.0495 1471.1323 1476.1618 1478.9728 1484.6610 1492.9056 1496.7412 1585.6210 1593.7213 1656.5689 2963.7648 2978.5021 2984.3246 2984.4839 2991.0606 2997.0101 3002.1831 3006.0279 3016.2566 3019.6755 3024.5750 3031.4620 3039.9523 3046.0280 3050.1929 3056.3778 3072.5431 3072.8567 3078.7069 3085.2646 3087.1991 3090.0607 3091.1443 3093.3699 3116.0933 3134.1635 3460.3859
redmass: 3.8129 3.6530 4.2156 4.6782 3.2224 5.7260 1.6344 3.8826 2.4837 4.2935 4.1416 2.3661 4.2179 3.6853 2.5756 1.6056 2.2387 1.9359 1.9025 2.5364 3.2436 2.0030 3.3301 2.5613 1.8264 2.7161 2.9575 2.7097 2.2808 2.9411 3.3396 3.8380 4.9195 3.8243 4.2475 4.3671 3.3119 3.7779 3.2207 3.2670 3.4798 2.9789 5.5233 4.7436 5.0419 2.4459 5.1154 2.7252 2.1543 2.1101 1.9593 2.4511 2.4995 1.8103 2.2012 2.6338 2.8741 1.7652 2.2957 1.9063 2.1340 2.4247 1.8749 2.2086 2.0155 2.2518 1.6176 2.1928 4.1500 2.9099 2.4026 2.5435 2.4547 3.1366 1.8874 2.0974 2.4628 2.4209 1.5456 1.3913 2.6486 1.6046 1.4412 1.8074 1.3199 1.7701 1.3007 1.3546 1.3555 1.2696 1.3734 1.3307 1.3356 1.2074 1.3498 1.3032 1.2285 1.3917 1.5322 1.3880 1.2443 1.3019 1.4012 1.1937 1.3088 1.1101 1.1096 1.0780 1.0692 1.0910 1.0490 1.0525 1.0842 1.0931 1.0507 1.0862 1.0522 9.4357 9.2647 7.1252 1.0442 1.0594 1.0428 1.0589 1.0354 1.0610 1.0613 1.0683 1.0573 1.0840 1.0872 1.1002 1.0907 1.0901 1.0865 1.0965 1.1013 1.1000 1.0992 1.1001 1.1028 1.0924 1.0952 1.1082 1.1001 1.0962 1.0648
irintensity: 0.5003 2.8489 1.6333 1.2787 1.5690 1.4418 0.0742 1.3995 0.8764 0.3334 4.2700 0.5064 1.4134 3.0652 10.3147 2.7260 1.4300 3.2538 3.2070 10.8798 2.1077 89.2890 5.7623 22.0844 7.6387 36.1862 7.2422 27.7318 3.2800 4.0083 0.8720 2.2818 1.9991 1.1981 1.9149 0.6099 4.4133 11.1985 2.0715 7.4331 6.7448 3.1660 16.2163 5.0730 6.3128 3.5443 15.0012 10.6274 20.9231 10.4646 2.0387 13.5399 6.5374 9.9146 4.7208 5.0581 26.7742 15.0561 2.6741 30.0569 3.4843 49.1981 32.8455 61.6781 12.0059 18.1939 2.7204 16.2684 18.6027 4.5895 212.8919 35.5978 23.9952 83.7893 4.3102 46.9061 196.8684 10.1212 8.4913 11.1931 121.8668 18.7953 4.1900 24.9885 6.5751 61.8852 4.5013 3.7756 10.6818 1.7478 4.9701 6.4169 9.3837 2.8045 5.8397 2.0193 3.7947 3.5768 19.7405 4.6153 11.3566 5.2139 18.9066 29.4354 16.9935 17.6842 11.2898 10.6399 15.6634 3.6261 26.8254 20.1626 4.9632 17.8872 14.2307 9.0610 2.8352 14.3617 224.2452 75.7837 13.9935 71.9942 52.8944 47.3530 16.8062 30.3528 27.9948 14.4127 31.9375 1.4981 18.8672 25.4652 30.7893 6.7403 5.0367 30.8048 51.7087 5.7553 32.4656 12.1911 41.5525 14.1019 36.7582 13.5137 13.7416 10.4034 26.0441
temp: 298.150 k
press: 1.00000 atm
elementType: 8 8 8 8 8 7 6 6 6 6 6 6 6 6 6 6 6 6 6 6 6 6 6 6 1 1 1 1 1 1 1 1 1 1 1 1 1 1 1 1 1 1 1 1 1 1 1 1 1 1 1
symmnumber: 1
zpe: 1122580.4 jmol-1
zpe.correction: 0.427568 hartree
zpe.thermalcorrener: 0.451682 hartree
zpe.thermalcorrenthalpy: 0.452626 hartree
zpe.thermalcorrgfe: 0.374573 hartree
zpe.sumelectzpe: -1131.099319 hartree
zpe.sumelectthermal: -1131.075205 hartree
zpe.sumelectthermalent: -1131.074261 hartree
zpe.sumelectthermalfe: -1131.152314 hartree
dipole: -2.6729 -1.3090 2.0920
dipole: 3.6379
quadrupole: -138.3266 -136.0015 -150.4351
quadrupole: -0.4640 -7.5840 4.8344
quadrupole: 3.2612 5.5862 -8.8474 -0.4640 -7.5840 4.8344
hfenergy: -1131.5268869 hartree
pointgroup: C01 [X(C18H27N1O5)]
dipole: 1.0750284 -0.6338416 -0.7007531 debye
polarizability: 247.907571|-4.6760105|186.1235901|-1.3170755|-6.9933582|197.9646001 unknown
InChI: InChI=1S/C18H27NO5/c1-4-12-9-11(2)18(3,22)17(21)23-10-13-5-7-19-8-6-14(15(13)19)24-16(12)20/h4,11,13-15,22H,5-10H2,1-3H3
charge 0 multiplicity 1
51 atoms
O  0.974656 1.609854 -0.28347
O  -0.533368 -1.47854 0.49931
O  -3.720114 -0.661053 -1.149434
O  -0.273545 1.888099 1.666439
O  -1.219235 -1.535814 -1.729431
N  3.743648 -0.371718 1.152481
C  2.274522 -0.175439 0.901138
C  1.858253 -1.150462 -0.270789
C  2.162705 1.335226 0.556238
C  3.172911 -1.919158 -0.626834
C  4.068855 -1.724467 0.632062
C  4.496148 0.783032 0.535491
C  3.447551 1.632359 -0.232154
C  0.761397 -2.147268 0.131844
C  -2.879293 -0.986407 0.011981
C  -0.240723 1.781398 0.412966
C  -2.948015 0.206471 1.021298
C  -1.457102 -1.301351 -0.514638
C  -2.750887 1.587715 0.323729
C  -1.451847 1.762275 -0.452642
C  -3.380416 -2.323487 0.633182
C  -4.299304 0.238066 1.775163
C  -1.471245 1.901872 -1.816984
C  -0.353278 2.102251 -2.805573
H  1.68338 -0.403928 1.805799
H  1.489863 -0.573152 -1.135976
H  2.089877 1.929957 1.483294
H  3.6530 -1.460559 -1.510619
H  2.99543 -2.985024 -0.864403
H  3.81553 -2.478791 1.402719
H  5.149206 -1.811725 0.424865
H  5.302907 0.419991 -0.129703
H  4.968089 1.383712 1.336127
H  3.693418 2.706709 -0.256566
H  3.328031 1.27815 -1.272804
H  0.55145 -2.848798 -0.695155
H  1.026383 -2.698485 1.050856
H  -2.13378 0.06255 1.756547
H  -2.791963 2.351806 1.123117
H  -3.604425 1.751344 -0.356093
H  -4.466647 -2.250856 0.798555
H  -3.198996 -3.165219 -0.059889
H  -2.875053 -2.535404 1.591286
H  -4.347865 1.139592 2.412737
H  -5.14436 0.274558 1.063786
H  -4.434163 -0.637251 2.433363
H  -2.47277 1.844782 -2.270036
H  -3.258855 -1.022347 -1.956398
H  -0.145986 1.141578 -3.32219
H  0.580668 2.437019 -2.33468
H  -0.662745 2.821538 -3.586714
