program: Gaussian 09
title: 000023831
version: EM64L-G09RevD.01
frameworkgroup: C1[X(C8H18N2O4S)]
method: RPBEPBE
basis: SDD
operation: Freq
keyword: #p
keyword: freq=noraman
keyword: PBEPBE/SDD
title: #p freq=noraman PBEPBE/SDD
converged: YES YES NO NO
title: Mulliken charges:
elementType: S O O O O N N C C C C C C C C H H H H H H H H H H H H H H H H H H
charge: 1.030268 -0.456129 -0.577218 -0.522722 -0.525737 -0.084377 -0.096422 -0.376249 -0.381018 -0.363852 -0.363096 -0.309611 -0.320905 -0.585819 -0.329522 0.209520 0.209066 0.213769 0.202163 0.194175 0.203419 0.213165 0.189363 0.233659 0.250305 0.207407 0.220014 0.300833 0.293882 0.206375 0.190977 0.347827 0.376490
chargesum: 0.00000
title: Mulliken charges with hydrogens summed into heavy atoms:
elementType: S O O O O N N C C C C C C C C
charge: 1.030268 -0.108302 -0.200728 -0.522722 -0.525737 -0.084377 -0.096422 0.042336 0.034915 0.033742 0.039432 0.174353 0.106516 0.008896 0.067830
polarizability: 2.15302205e+02 4.04127783e+00 1.25737777e+02 -5.35928510e+00 8.06457248e-01 1.17222516e+02
1716.lowfreq: -5.1334 -0.0010 0.0011 0.0019 2.8976 10.2522 16.0989 24.3036 33.6842
frequency: 15.2081 24.0369 33.4344 49.0399 61.7018 76.1605 93.9006 111.7193 161.0760 167.5223 216.4916 226.9568 244.8295 264.4239 270.7293 286.8213 290.5417 312.8185 328.9079 333.9608 369.4909 397.5698 404.8551 484.7120 487.0724 538.7084 566.3610 614.4186 754.7448 773.5900 786.9885 817.8126 838.6751 845.2015 918.3132 937.1286 975.7398 996.2382 1008.3394 1012.6995 1026.6178 1036.7966 1051.9117 1056.8470 1078.7913 1093.5706 1117.2003 1143.8336 1150.5767 1153.1438 1186.7206 1195.8827 1211.3272 1231.7856 1246.2196 1264.3764 1280.3767 1294.5602 1309.0968 1312.3001 1331.9511 1341.9034 1353.4931 1367.1623 1380.4105 1382.3035 1407.5623 1418.6823 1453.8721 1454.7418 1460.8480 1465.9905 1475.1295 1480.5082 1485.6554 2859.9539 2867.5496 2891.1843 2896.5218 2908.0989 2940.7447 2948.2855 3007.0914 3035.1661 3039.1005 3041.4609 3045.8753 3053.8557 3060.0256 3073.8408 3172.0692 3497.0268 3578.1061
redmass: 4.2720 6.3269 5.5764 3.1669 3.1814 4.3281 2.8544 6.7063 2.0473 3.0613 3.2333 2.1392 1.8785 1.0892 2.8735 5.5401 4.9698 5.2264 2.7980 3.1294 3.6783 4.1965 2.1875 3.7833 3.7286 9.3291 6.6996 1.9719 3.6879 1.3310 2.4144 1.2048 11.4234 1.5201 2.4910 3.0270 5.9224 2.6643 1.7702 1.8570 2.0120 2.0332 1.7475 2.3650 1.7868 1.9621 1.7063 2.4685 1.8961 2.3995 1.2834 1.1174 1.2746 1.2036 1.7385 1.3199 1.3346 1.3183 1.3381 1.3126 1.3177 1.3094 1.3653 1.4674 1.3635 1.4156 1.1240 1.4728 1.0779 1.0809 1.0936 1.0978 1.0831 1.0825 1.0856 1.0712 1.0698 1.0692 1.0684 1.0693 1.0684 1.0574 1.1021 1.0910 1.0912 1.0904 1.0891 1.0938 1.0938 1.0564 1.1119 1.0665 1.0666
irintensity: 0.8113 1.6870 1.3162 6.5824 6.1564 1.2046 2.4090 3.4752 37.1989 15.0772 38.8597 28.9644 0.7062 148.4636 6.8647 21.6486 53.2408 28.8913 6.9435 14.6729 11.2011 37.2791 2.4657 10.0633 13.8454 187.3447 21.1298 4.6760 8.4532 5.1406 13.6944 1.1124 50.6794 0.4432 37.7678 39.5957 130.9462 41.7796 35.4292 40.5260 14.7434 14.1906 5.6671 37.5370 4.0633 11.0933 36.1920 101.7021 7.3467 52.6246 1.8624 0.9841 31.9512 7.9534 7.9958 10.0989 3.4212 13.6004 24.8548 0.5357 9.6126 7.0141 17.6952 5.2335 16.2091 7.2103 10.2413 0.2385 1.9879 0.6426 25.1655 7.5668 6.3786 23.5265 8.1229 59.3852 54.2932 26.6414 142.0596 108.2716 40.1317 69.9625 46.0176 19.7100 32.4282 50.4919 16.1398 65.7985 11.5185 2.5311 0.1282 47.2288 4.3326
temp: 298.150 k
press: 1.00000 atm
elementType: 16 8 8 8 8 7 7 6 6 6 6 6 6 6 6 1 1 1 1 1 1 1 1 1 1 1 1 1 1 1 1 1 1
symmnumber: 1
zpe: 704104.3 jmol-1
zpe.correction: 0.268179 hartree
zpe.thermalcorrener: 0.286494 hartree
zpe.thermalcorrenthalpy: 0.287439 hartree
zpe.thermalcorrgfe: 0.218733 hartree
zpe.sumelectzpe: -1122.651091 hartree
zpe.sumelectthermal: -1122.632775 hartree
zpe.sumelectthermalent: -1122.631831 hartree
zpe.sumelectthermalfe: -1122.700537 hartree
dipole: 4.2038 -0.4036 0.1408
dipole: 4.2255
quadrupole: -111.9532 -99.2880 -103.6790
quadrupole: -2.7272 -19.8899 0.5354
quadrupole: -6.9798 5.6854 1.2944 -2.7272 -19.8899 0.5354
hfenergy: -1122.9192697 hartree
pointgroup: C01 [X(C8H18N2O4S1)]
dipole: 1.6557971 -0.1440364 0.0350828 debye
polarizability: 215.1744542|5.8031259|125.5255261|-4.8001906|1.7985423|117.5625166 unknown
InChI: InChI=1S/C8H18N2O4S/c11-7-5-9-1-3-10(4-2-9)6-8-15(12,13)14/h11-12H,1-8H2
charge 0 multiplicity 1
33 atoms
S  -4.302385 -0.316549 -0.088087
O  6.296336 -0.678228 0.181973
O  -4.937659 -0.856059 1.595195
O  -4.571476 -1.48701 -1.177284
O  -4.803473 1.18924 -0.416623
N  -0.203585 0.308169 -0.132493
N  2.675836 0.227322 -0.010828
C  0.545283 -0.843096 -0.688766
C  0.591677 1.558625 -0.158002
C  1.876207 -1.020173 0.059968
C  1.920791 1.354262 0.589148
C  -1.597278 0.418851 -0.590619
C  4.045936 0.074237 0.535923
C  -2.451707 -0.289032 0.475621
C  4.999173 -0.536209 -0.500999
H  0.756826 -0.694427 -1.775418
H  -0.062664 -1.760429 -0.581366
H  0.012606 2.361378 0.333744
H  0.814445 1.876333 -1.205117
H  1.65917 -1.304956 1.120633
H  2.44446 -1.846204 -0.40394
H  2.527601 2.274323 0.507085
H  1.699222 1.178354 1.672114
H  -1.760503 -0.037268 -1.59198
H  -1.898248 1.479079 -0.65937
H  4.071852 -0.550162 1.460459
H  4.435256 1.071536 0.809382
H  -2.480171 0.244929 1.436051
H  -2.215591 -1.355398 0.60866
H  5.068764 0.139473 -1.377608
H  4.625742 -1.52395 -0.845938
H  6.970091 -1.02329 -0.455243
H  -5.924134 -1.002071 1.519723
