program: Gaussian 09
title: 000253227
version: EM64L-G09RevD.01
frameworkgroup: C1[X(C10H16N4O)]
method: RPBEPBE
basis: SDD
operation: Freq
keyword: #p
keyword: freq=noraman
keyword: PBEPBE/SDD
title: #p freq=noraman PBEPBE/SDD
converged: YES YES NO NO
title: Mulliken charges:
elementType: O N N N N C C C C C C C C C C H H H H H H H H H H H H H H H H
charge: -0.243703 -0.043794 -0.426813 -0.390423 -0.045087 -0.474338 -0.355433 0.165773 -0.675400 -0.804825 0.166357 0.436545 -0.439926 -0.784557 0.004789 0.223446 0.204598 0.219284 0.202027 0.210197 0.223998 0.213486 0.251985 0.246398 0.244843 0.349399 0.339934 0.249466 0.238830 0.253707 0.239240
chargesum: 0.00000
title: Mulliken charges with hydrogens summed into heavy atoms:
elementType: O N N N N C C C C C C C C C C
charge: -0.243703 -0.043794 -0.077414 -0.050489 -0.045087 -0.046294 0.065878 0.165773 -0.027720 -0.061599 0.166357 0.436545 -0.190461 -0.052781 0.004789
polarizability: 2.42629843e+02 7.03482711e+00 1.44919475e+02 -9.09926169e+00 -4.17249212e+00 8.45550407e+01
1716.lowfreq: -16.0502 -3.8149 0.0005 0.0007 0.0008 0.9796 32.6267 39.2344 59.7968
frequency: 32.1658 39.1509 59.7823 83.7513 96.9982 117.4352 129.3007 154.7432 160.7960 189.3274 217.6451 227.5508 230.6805 255.4222 307.5595 325.3453 368.4525 440.0783 481.9816 502.0341 535.1941 548.7346 552.6834 586.5124 603.1809 669.1022 711.2371 734.7107 742.2322 743.2355 825.4993 864.1736 865.0065 874.4012 901.1891 952.6129 990.2335 1008.1658 1010.7705 1036.5886 1049.1097 1052.7295 1075.3317 1093.0800 1124.4721 1152.8534 1216.6745 1225.5096 1254.6637 1276.0548 1284.9338 1301.9785 1337.2593 1377.2347 1389.6910 1392.3594 1401.8695 1421.0978 1455.0387 1457.2066 1465.6320 1471.2201 1473.2276 1475.4498 1477.5870 1484.5797 1487.4642 1557.5416 1608.7812 1624.5609 1654.4862 2960.0941 2968.9561 2976.0790 2979.0383 2982.2966 3027.5068 3031.1515 3054.8444 3057.3473 3075.5235 3078.9272 3105.1729 3115.6403 3187.4318 3481.3767 3483.7817
redmass: 4.7611 3.4486 2.2754 2.4508 3.6803 1.4029 1.4060 2.0207 2.6736 2.8767 3.8357 3.8381 1.2452 3.2087 3.0304 3.1867 3.9269 3.8616 4.8063 2.6700 3.2981 4.2294 4.2371 1.9117 3.6062 3.7087 4.3774 1.6233 1.5016 1.6282 2.9523 1.5413 1.4577 2.9564 2.2601 2.3441 1.6365 2.2973 2.1008 2.0725 2.7648 1.5275 2.3276 2.0879 2.4749 2.7770 1.7905 1.4324 1.9530 1.3653 1.1211 2.1459 1.4867 2.0801 1.2742 1.2104 1.3149 2.4887 1.1361 1.6537 1.0437 1.1488 1.0612 1.1495 1.0659 1.2197 1.2862 5.6822 8.3607 5.4815 6.9282 1.0402 1.0622 1.0363 1.0389 1.0613 1.0981 1.0973 1.0979 1.0993 1.1014 1.0993 1.0957 1.0970 1.0933 1.0779 1.0761
irintensity: 3.3106 1.8012 1.2601 0.2672 4.5650 0.2533 4.3417 0.2752 0.9590 0.4600 2.5345 0.8419 0.5278 1.1364 4.1654 10.3238 5.6543 4.5781 3.4526 16.2754 16.4086 1.4977 9.1090 68.8236 12.6213 0.1362 1.5209 73.7880 4.2145 9.7307 9.8385 16.6076 32.0000 33.1863 2.4528 9.7490 16.0483 6.5734 3.3703 37.3228 0.3389 9.7224 34.2701 24.8086 118.3075 16.7756 40.3384 3.3572 46.8959 7.7252 2.5109 28.5002 3.9039 21.5081 13.8933 13.5481 42.5795 48.4785 28.4752 160.0090 17.2675 15.2637 14.8916 12.8752 5.4344 52.1457 101.5956 980.3499 14.5635 243.8490 385.7516 13.0086 17.1224 47.0942 22.5530 37.7979 5.5760 12.8507 16.5071 4.8717 78.8439 44.3234 17.8246 11.9685 4.1220 84.3171 44.5434
temp: 298.150 k
press: 1.00000 atm
elementType: 8 7 7 7 7 6 6 6 6 6 6 6 6 6 6 1 1 1 1 1 1 1 1 1 1 1 1 1 1 1 1
symmnumber: 1
zpe: 669074.4 jmol-1
zpe.correction: 0.254837 hartree
zpe.thermalcorrener: 0.271130 hartree
zpe.thermalcorrenthalpy: 0.272074 hartree
zpe.thermalcorrgfe: 0.209992 hartree
zpe.sumelectzpe: -683.739660 hartree
zpe.sumelectthermal: -683.723367 hartree
zpe.sumelectthermalent: -683.722423 hartree
zpe.sumelectthermalfe: -683.784505 hartree
dipole: 8.6311 4.4566 -1.0699
dipole: 9.7725
quadrupole: -109.3322 -85.7700 -91.6944
quadrupole: -26.9136 3.4315 1.5710
quadrupole: -13.7333 9.8288 3.9045 -26.9136 3.4315 1.5710
hfenergy: -683.9944966 hartree
pointgroup: C01 [X(C10H16N4O1)]
dipole: 2.8588857 1.5017164 2.086651 debye
polarizability: 232.8736868|24.3867902|101.8405394|20.5500843|30.0674163|137.3901331 unknown
InChI: InChI=1S/C10H16N4O/c1-4-5-7(2)13-14-10-11-8(3)6-9(15)12-10/h6,11,14H,4-5H2,1-3H3
charge 0 multiplicity 1
31 atoms
O  -4.105641 -2.157095 -2.461537
N  1.080963 -0.237755 -0.371536
N  -1.538767 -0.302704 0.125224
N  0.253744 -0.876461 -1.288283
N  -1.902617 -1.536526 -1.915109
C  3.241954 0.493641 0.42832
C  4.164523 -0.493455 1.199844
C  2.377276 -0.188998 -0.610084
C  5.083741 0.236131 2.202416
C  3.027567 -0.790591 -1.844227
C  -1.119602 -0.923456 -1.044195
C  -2.90225 -0.303356 0.452242
C  -3.775745 -0.925046 -0.411857
C  -3.282135 0.38713 1.738215
C  -3.313078 -1.582195 -1.657908
H  2.58767 1.020869 1.146251
H  3.877939 1.257142 -0.066016
H  3.532572 -1.230336 1.731892
H  4.782657 -1.067642 0.481294
H  5.749247 0.951882 1.68394
H  5.719981 -0.478843 2.754534
H  4.491866 0.804543 2.94397
H  4.109955 -0.590268 -1.854632
H  2.890747 -1.890267 -1.887401
H  2.59912 -0.367456 -2.775336
H  -0.812463 0.131883 0.705241
H  0.573151 -1.335534 -2.148215
H  -4.84647 -0.94973 -0.197068
H  -2.780995 -0.079574 2.607671
H  -4.369523 0.326063 1.896967
H  -2.996786 1.456304 1.719783
