program: Gaussian 09
title: 000253226
version: EM64L-G09RevD.01
frameworkgroup: C1[X(C10H16N2)]
method: RPBEPBE
basis: SDD
operation: Freq
keyword: #pfreq=noraman
keyword: PBEPBE/SDD
title: #p freq=noraman PBEPBE/SDD
converged: YES YES NO NO
title: Mulliken charges:
elementType: N N C C C C C C C C C C H H H H H H H H H H H H H H H H
charge: -0.294134 0.000987 -0.380145 -0.366477 -0.548155 -0.370520 0.489178 -0.342690 -0.505428 -0.626149 -0.187993 -0.335648 0.206389 0.211561 0.218044 0.183304 0.209918 0.206239 0.207674 0.179473 0.249827 0.243347 0.246400 0.189556 0.221538 0.225395 0.228352 0.240157
chargesum: 0.00000
title: Mulliken charges with hydrogens summed into heavy atoms:
elementType: N N C C C C C C C C C C
charge: -0.044307 0.000987 0.037805 0.034871 -0.131998 0.016627 0.489178 -0.099342 -0.259027 0.010339 0.040358 -0.095491
polarizability: 1.58846318e+02 -5.32929405e+00 1.10683106e+02 1.48397006e+01 1.55855434e+00 8.62829654e+01
1716.lowfreq: -11.7747 -3.9274 -0.0008 -0.0007 -0.0002 8.8142 20.9237 43.2173 51.7094
frequency: 20.9092 43.0174 51.7015 66.0975 118.6594 131.1723 134.4373 222.4872 226.3532 259.2365 325.4184 376.1333 400.3085 437.9087 510.8014 595.2938 626.8387 659.2478 724.8330 740.2917 790.1765 797.4104 826.3808 908.1382 923.8913 937.0098 951.3263 986.4035 1004.0955 1018.2882 1030.4144 1035.8687 1060.3948 1072.0322 1093.5625 1121.9168 1128.3306 1163.6819 1191.8583 1197.4447 1231.1273 1240.4241 1253.4476 1280.0239 1284.7387 1309.0788 1311.4327 1339.5175 1342.2170 1371.9761 1414.6306 1436.0171 1449.0886 1457.7807 1465.6213 1466.9059 1469.4984 1482.9754 1489.8664 1498.4139 1557.4428 1586.4159 2835.9629 2870.3905 2956.6036 2969.2436 2980.0140 2989.8502 3009.7784 3011.2785 3030.7069 3051.8248 3073.5349 3110.1313 3122.3976 3131.7706 3162.1685 3444.1122
redmass: 3.8328 1.8864 3.9166 2.6336 2.0665 3.6083 2.0218 3.4628 1.4045 2.6148 2.4067 3.0592 3.3499 3.3171 3.7416 5.6605 6.0593 1.3190 1.8631 1.0817 1.1829 2.7691 2.4070 1.3164 1.3561 1.5750 2.0424 1.3962 3.5273 4.1272 2.9702 2.5640 1.7333 2.2058 1.3125 1.5806 1.4998 3.3574 1.4945 1.5598 1.7913 1.3400 1.4358 1.1334 1.1142 1.3899 6.3429 1.2361 1.4263 1.4880 2.0646 1.1493 1.1948 2.1830 1.0761 1.0772 1.0892 1.0909 1.0698 1.0719 5.4910 5.9569 1.0713 1.0566 1.0642 1.0597 1.0608 1.0824 1.0982 1.0749 1.1015 1.1041 1.0993 1.0909 1.0886 1.0914 1.0998 1.0744
irintensity: 2.3348 2.9706 0.0416 1.0654 0.8281 0.7566 1.5017 0.2730 1.4755 3.9661 0.5358 7.1664 1.5468 3.2174 2.4365 2.3655 4.0111 121.2158 38.4946 7.3228 0.2081 14.6697 16.6673 1.0053 1.1586 0.9577 3.7460 0.0608 8.1236 1.5976 0.7828 1.3012 4.6586 0.7269 13.0948 9.9881 17.9965 28.2451 3.4093 1.2603 1.1592 2.1264 11.4918 1.6104 0.1262 1.1878 0.5237 1.6612 0.7933 10.1191 19.2039 2.0438 20.5515 23.6510 7.9302 0.9890 2.3641 12.3795 14.5471 8.7229 5.1193 1.5829 93.0812 169.6021 15.0498 4.8591 57.1450 54.5080 1.2322 51.1993 4.6197 90.5811 41.4709 28.2045 5.7853 21.4016 28.3566 1.5840
temp: 298.150 k
press: 1.00000 atm
elementType: 7 7 6 6 6 6 6 6 6 6 6 6 1 1 1 1 1 1 1 1 1 1 1 1 1 1 1 1
symmnumber: 1
zpe: 636402.4 jmol-1
zpe.correction: 0.242393 hartree
zpe.thermalcorrener: 0.255294 hartree
zpe.thermalcorrenthalpy: 0.256239 hartree
zpe.thermalcorrgfe: 0.200666 hartree
zpe.sumelectzpe: -499.214130 hartree
zpe.sumelectthermal: -499.201229 hartree
zpe.sumelectthermalent: -499.200284 hartree
zpe.sumelectthermalfe: -499.255858 hartree
dipole: 1.9666 1.2281 0.3467
dipole: 2.3443
quadrupole: -78.6608 -71.4322 -76.5542
quadrupole: -14.5125 -4.3496 -2.8685
quadrupole: -3.1118 4.1169 -1.0051 -14.5125 -4.3496 -2.8685
hfenergy: -499.4565232 hartree
pointgroup: C01 [X(C10H16N2)]
dipole: -0.7774351 -0.4949932 -0.0355729 debye
polarizability: 159.1830566|-0.7330386|109.1016882|-14.9127253|6.339607|87.5276443 unknown
InChI: InChI=1S/C10H16N2/c1-11-7-3-2-5-10-6-4-8-12-9-10/h4,6,8-9,11H,2-3,5,7H2,1H3
charge 0 multiplicity 1
28 atoms
N  -4.766979 0.015633 0.157371
N  3.579849 1.237752 -0.197962
C  -0.899196 0.020175 0.010599
C  -2.320744 -0.02414 0.611582
C  0.209824 -0.076321 1.095786
C  -3.42555 0.072687 -0.458379
C  1.607034 -0.063895 0.502142
C  2.224569 -1.246014 0.019011
C  2.339935 1.145072 0.366806
C  -5.886678 0.04723 -0.80136
C  3.507853 -1.176533 -0.566327
C  4.145662 0.082379 -0.65732
H  -0.77361 -0.81222 -0.711262
H  -0.759612 0.956414 -0.566332
H  -2.466765 -0.962118 1.181902
H  -2.437336 0.809357 1.337543
H  0.054561 -1.004684 1.680311
H  0.09293 0.769485 1.80181
H  -3.336522 -0.784389 -1.156608
H  -3.266485 0.998171 -1.072084
H  -4.869875 0.725904 0.894785
H  1.706021 -2.208556 0.107258
H  1.914886 2.089068 0.732475
H  -5.888214 0.933891 -1.483143
H  -6.846429 0.032112 -0.254839
H  -5.852575 -0.857334 -1.437233
H  4.00846 -2.07475 -0.94224
H  5.140788 0.181324 -1.105993
