program: Gaussian 09
title: 000253224
version: EM64L-G09RevD.01
frameworkgroup: C1[X(C9H14N4O)]
method: RPBEPBE
basis: SDD
operation: Freq
keyword: #p
keyword: freq=noraman
keyword: PBEPBE/SDD
title: #p freq=noraman PBEPBE/SDD
converged: NO NO NO NO
title: Mulliken charges:
elementType: O N N N N C C C C C C C C C H H H H H H H H H H H H H H
charge: -0.233364 -0.456349 -0.413691 0.102933 0.027764 -0.100146 -0.688471 -0.688467 -0.260586 0.426960 0.185582 -0.430914 -0.791043 0.020576 0.249179 0.199050 0.223144 0.234331 0.223140 0.234347 0.199050 0.197276 0.297843 0.249586 0.256908 0.237614 0.237619 0.260129
chargesum: 0.00000
title: Mulliken charges with hydrogens summed into heavy atoms:
elementType: O N N N N C C C C C C C C C
charge: -0.233364 -0.158506 -0.156782 0.102933 0.027764 0.149033 -0.031946 -0.031931 -0.063310 0.426960 0.185582 -0.181328 -0.055680 0.020576
polarizability: 2.14235255e+02 -8.69544718e+00 1.45079011e+02 -6.00608868e-03 1.32434244e-02 7.85597849e+01
1716.lowfreq: -13.8648 -1.4600 -0.0007 -0.0003 0.0008 9.2456 12.8718 35.6276 63.8987
frequency: 9.3330 35.4933 63.8984 80.5248 112.1804 131.9359 173.9337 193.9124 195.1037 200.9867 221.5485 222.1279 250.4441 307.0340 382.3451 410.0349 427.6460 474.4197 478.7884 503.4589 540.7823 544.8579 569.0838 596.2961 668.4166 700.0841 735.1071 853.4434 863.1898 866.6683 914.5668 922.7153 940.6352 956.9916 960.7852 985.4751 1051.0952 1055.4468 1086.9329 1106.6768 1149.5110 1157.8248 1193.3343 1216.7913 1242.3860 1287.6281 1310.3121 1340.6938 1353.0839 1376.1213 1393.7553 1400.7984 1421.9560 1465.6996 1465.9752 1466.7255 1471.0129 1478.6384 1485.7976 1534.2469 1561.8538 1609.0670 1625.9020 1659.9629 2912.7449 2970.6742 2973.1527 2974.0612 3029.4139 3049.0109 3062.6844 3073.5159 3082.4669 3086.2006 3116.4492 3184.1271 3358.3112 3518.9131
redmass: 2.7419 3.4974 4.6745 3.0678 2.4376 1.5098 3.8116 1.9008 2.0369 1.3010 3.3777 3.5562 1.4382 3.0992 3.1193 3.2501 1.9286 1.8669 6.6223 4.2329 5.9022 4.0733 1.2411 5.8054 6.3162 5.0101 4.3502 2.3116 6.0112 1.4509 1.4162 1.2230 2.0687 1.4827 3.3914 2.0022 1.5232 3.0455 3.9904 2.5745 3.1278 2.1096 2.0284 1.9306 2.0959 1.3209 1.3160 1.4788 2.0114 1.1943 1.2125 1.2919 2.9604 1.0438 1.0509 1.0440 1.1810 1.0500 1.0557 1.7980 4.1493 7.4182 6.8006 6.5778 1.0853 1.0358 1.0364 1.0392 1.0857 1.0980 1.0989 1.0973 1.1006 1.0999 1.0964 1.0936 1.0745 1.0777
irintensity: 0.3868 0.0047 4.6073 1.9437 1.0836 0.1560 11.8285 2.0517 1.5321 0.6423 0.3447 4.5466 3.0084 1.6509 2.0021 0.6078 0.1045 7.3463 1.0069 9.2656 0.1674 0.6114 178.6126 4.5577 0.0959 1.0926 0.7304 3.1448 3.9428 34.5298 11.1594 14.2894 10.8057 2.0672 44.9458 4.1171 8.6369 36.4735 121.6751 7.4337 2.8061 0.7510 65.7385 246.1901 112.8180 4.1041 0.1234 18.9780 9.9831 15.6936 6.8524 23.2453 107.2285 18.8358 4.6711 1.9030 23.0191 6.0464 18.7042 350.6762 622.6373 2.6647 257.3093 279.3898 54.4658 27.4120 46.3048 28.0759 0.5522 17.7357 2.6997 84.5226 22.2170 44.4369 10.0025 4.3161 36.5460 16.6850
temp: 298.150 k
press: 1.00000 atm
elementType: 8 7 7 7 7 6 6 6 6 6 6 6 6 6 1 1 1 1 1 1 1 1 1 1 1 1 1 1
symmnumber: 1
zpe: 591285.4 jmol-1
zpe.correction: 0.225209 hartree
zpe.thermalcorrener: 0.240508 hartree
zpe.thermalcorrenthalpy: 0.241453 hartree
zpe.thermalcorrgfe: 0.180619 hartree
zpe.sumelectzpe: -644.486759 hartree
zpe.sumelectthermal: -644.471459 hartree
zpe.sumelectthermalent: -644.470515 hartree
zpe.sumelectthermalfe: -644.531349 hartree
dipole: 1.6156 -10.4325 -0.0027
dipole: 10.5569
quadrupole: -66.6284 -90.2981 -85.4690
quadrupole: 17.3443 0.0007 0.0009
quadrupole: 14.1701 -9.4996 -4.6705 17.3443 0.0007 0.0009
hfenergy: -644.7119675 hartree
pointgroup: C01 [X(C9H14N4O1)]
dipole: -0.7191364 -4.0906619 0.0036696 debye
polarizability: 214.5608198|7.2794084|144.7534018|-0.0150302|-0.0552516|78.5598289 unknown
InChI: InChI=1S/C9H14N4O/c1-6(2)5-10-13-9-11-7(3)4-8(14)12-9/h4-6,11,13H,1-3H3
charge 0 multiplicity 1
28 atoms
O  2.622774 2.673553 -0.002896
N  1.743245 -1.312577 0.000376
N  -0.553868 -0.838066 0.00038
N  -1.660002 0.000945 -0.000769
N  0.996796 0.975076 -0.00128
C  -4.097754 0.288078 -0.001014
C  -4.932422 0.010001 -1.279812
C  -4.932173 0.014114 1.278846
C  -2.84413 -0.557605 0.000201
C  3.098601 -0.943454 -0.000009
C  0.746914 -0.313269 -0.00024
C  3.410433 0.396011 -0.001072
C  4.098086 -2.07454 0.000784
C  2.357472 1.436314 -0.001882
H  -3.774487 1.345087 -0.002729
H  -5.248262 -1.050669 -1.3258
H  -5.845489 0.633426 -1.284433
H  -4.352956 0.239057 -2.191681
H  -5.84526 0.637522 1.281642
H  -4.352526 0.246131 2.18985
H  -5.247985 -1.046405 1.328327
H  -2.990521 -1.663296 0.001944
H  1.50086 -2.30567 0.000914
H  4.453106 0.722462 -0.001379
H  -0.681169 -1.86233 0.001868
H  3.982127 -2.716838 -0.893672
H  3.982256 -2.715459 0.896242
H  5.122834 -1.673798 0.000394
