program: Gaussian 09
title: 000253222
version: EM64L-G09RevD.01
frameworkgroup: C1[X(C8H12N4O)]
method: RPBEPBE
basis: SDD
operation: Freq
keyword: #p
keyword: freq=noraman
keyword: PBEPBE/SDD
title: #p freq=noraman PBEPBE/SDD
converged: YES YES NO NO
title: Mulliken charges:
elementType: O N N N N C C C C C C C C H H H H H H H H H H H H
charge: -0.240692 -0.426695 -0.382477 -0.043214 -0.000394 0.437137 0.172629 -0.438474 -0.783923 -0.402890 0.007684 -0.216271 -0.664677 0.349167 0.250268 0.239540 0.254460 0.239691 0.225276 0.215728 0.321771 0.216542 0.228097 0.214138 0.227581
chargesum: 0.00000
title: Mulliken charges with hydrogens summed into heavy atoms:
elementType: O N N N N C C C C C C C C
charge: -0.240692 -0.077529 -0.060707 -0.043214 -0.000394 0.437137 0.172629 -0.188206 -0.050232 0.038113 0.007684 0.000270 0.005139
polarizability: 2.14894319e+02 -1.21666411e+01 1.22773670e+02 6.17155517e+00 -1.11368293e+00 6.52885970e+01
1716.lowfreq: -0.0008 0.0002 0.0004 1.9820 2.3217 8.4536 43.4241 56.6054 86.6692
frequency: 43.4041 56.5112 86.6678 115.3990 124.0319 151.9302 189.1380 199.1412 221.2821 253.0489 283.8068 295.6183 342.7948 438.8455 471.2638 496.2393 550.7869 551.8514 585.7890 596.0506 668.1680 701.1615 728.9615 741.8908 782.9182 866.5227 873.0961 898.4285 915.0916 952.0289 1007.9340 1021.6846 1047.3687 1052.9057 1067.4195 1101.5986 1148.5022 1161.9336 1216.7757 1248.2902 1275.7301 1301.0595 1328.2686 1381.0828 1390.7144 1406.0306 1449.9214 1457.4067 1460.7853 1466.7379 1477.3992 1482.6679 1484.8782 1560.4410 1617.4682 1627.2245 1656.0679 2974.8777 2979.0019 2984.1798 2992.1375 3054.6761 3056.2171 3084.0684 3091.8451 3115.8160 3187.6113 3449.9108 3489.9618
redmass: 3.3963 3.9205 2.7344 1.9030 1.8994 2.6908 3.3032 1.4107 5.8918 2.1864 3.4402 3.9307 3.8921 3.3678 4.8145 5.6234 3.9455 7.2600 4.2348 1.1809 3.4841 4.8728 1.4500 3.2989 1.2478 1.4534 5.5745 1.4995 1.6231 2.4275 3.9366 2.3554 2.3315 1.5272 1.7329 3.5653 2.8051 2.4443 1.7550 1.2039 1.5117 1.3618 1.4529 2.5274 1.2050 1.3638 2.3256 1.3685 1.2761 1.0437 1.0575 1.3369 1.2965 5.6920 7.5057 5.4847 6.9195 1.0652 1.0391 1.0381 1.0841 1.0979 1.0963 1.0992 1.1013 1.0969 1.0934 1.0768 1.0777
irintensity: 0.1735 2.1532 3.0197 1.7644 1.2605 0.7503 0.3004 5.8974 0.4258 13.0737 5.9023 7.1981 17.4134 5.6287 3.7508 0.8429 0.5417 0.2149 0.5109 119.0820 0.0092 5.0201 84.8326 0.6711 6.9165 33.4972 43.1633 24.7788 18.3671 7.7328 6.7725 15.6148 27.3250 9.9111 13.0541 170.4477 22.1225 17.7814 26.7748 13.9980 31.1900 17.3843 12.6557 9.1548 6.1978 36.1040 106.2005 111.9515 21.9919 17.3689 22.1583 48.0681 67.0895 912.6544 29.4536 203.7050 379.1539 30.1093 21.5819 37.1281 35.0154 16.3036 3.6131 51.8847 41.1873 11.3949 3.8211 13.4328 101.9373
temp: 298.150 k
press: 1.00000 atm
elementType: 8 7 7 7 7 6 6 6 6 6 6 6 6 1 1 1 1 1 1 1 1 1 1 1 1
symmnumber: 1
zpe: 523608.3 jmol-1
zpe.correction: 0.199432 hartree
zpe.thermalcorrener: 0.212722 hartree
zpe.thermalcorrenthalpy: 0.213667 hartree
zpe.thermalcorrgfe: 0.158948 hartree
zpe.sumelectzpe: -605.283690 hartree
zpe.sumelectthermal: -605.270399 hartree
zpe.sumelectthermalent: -605.269455 hartree
zpe.sumelectthermalfe: -605.324174 hartree
dipole: -7.8453 5.3468 -0.5145
dipole: 9.5079
quadrupole: -83.9352 -76.5968 -78.8384
quadrupole: 23.0742 -0.0084 1.1587
quadrupole: -4.1451 3.1933 0.9517 23.0742 -0.0084 1.1587
hfenergy: -605.4831217 hartree
pointgroup: C01 [X(C8H12N4O1)]
dipole: 2.4624217 0.9202777 2.6612924 debye
dipolederiv: -0.9449229 -0.1143026 -0.410078 -0.154374 -0.4701644 -0.2139714 -0.5093713 -0.202936 -0.9726095 -1.1573829 0.0795604 -0.138604 0.347193 -0.3579086 -0.1978235 0.3880946 -0.2787137 -0.661837 -1.6948704 0.0359161 -0.2981906 -0.2113156 -0.3063644 0.0224967 -0.8962035 0.094857 -0.3983767 -1.7943777 -0.0421022 -0.548699 -0.0361258 -0.3330766 -0.0824284 -0.5888527 -0.0875153 -0.6557475 0.4188567 0.0627592 0.3239412 0.442495 -0.1387947 0.0822127 1.0884489 -0.0275636 0.1586513 0.9302984 -0.0271984 0.2477008 -0.1691744 0.1278995 0.1936452 -0.0328268 0.2374449 0.4910953 2.4021043 -0.0954356 0.467155 -0.3107155 0.3767942 0.241885 0.114785 0.2998696 0.8719613 -0.2335753 0.0126925 0.0219767 -0.0416824 -0.3016527 -0.2277065 -0.0979376 -0.2065863 -0.6610526 -0.0124333 0.0120328 -0.004113 0.0630174 0.0270701 -0.0856216 0.0984716 -0.1012667 -0.0972978 -0.1355031 -0.0491691 -0.0514932 0.0010363 0.1110985 -0.0148982 0.0448725 -0.0318601 0.0534831 1.7624002 0.023661 0.540282 -0.0065916 0.4072433 0.3804726 0.5194609 0.3885214 1.1933987 -0.0080362 -0.1048289 -0.1493286 -0.0229388 -0.0414494 0.2352011 0.1603075 0.2394062 0.3034901 0.0544212 -0.0447202 0.0127992 -0.0375285 0.0518134 0.0214203 -0.1667731 0.0023276 0.0024973 0.4172722 -0.0109069 0.0028347 -0.0248252 0.2818726 -0.0496221 -0.0144151 -0.048339 0.2031794 -0.0555875 0.0549676 0.0380311 0.058239 0.1393011 -0.0399246 0.0434927 -0.0408126 0.0983073 0.0962232 0.0527976 -0.0552028 0.0383114 0.0278855 0.0995269 -0.014601 0.0474228 -0.0828945 -0.1000781 0.0519831 0.0336118 0.0086225 0.1140387 -0.0174622 -0.056712 -0.0032714 0.0988441 0.0540027 -0.1168969 -0.0076834 -0.0709386 -0.0723227 -0.0695094 0.0184177 -0.0280997 0.0591564 -0.0090784 0.0382042 0.1180431 0.0013979 0.0417458 -0.0876167 0.058851 -0.0544478 -0.0228226 -0.0196471 0.0583421 -0.080718 0.0145996 -0.089768 0.0859321 -0.1426979 0.0661847 0.0109425 0.0702183 0.0340333 -0.0233086 0.0256027 0.2992349 -0.0960609 -0.055621 -0.0938537 0.1415485 -0.0314268 0.0409426 0.016031 0.0643935 0.1041151 -0.1275117 0.0354291 -0.1524279 -0.1037751 0.0618124 0.0863119 -0.0269785 0.0331136 -0.0934005 0.0827518 0.0084255 0.0955337 0.0631796 0.0245458 0.0296436 0.0991159 0.0863027 0.0211733 -0.086518 0.1427258 -0.0641346 -0.0312844 -0.0952356 -0.0682874 -0.1271248 -0.0981142 0.0736162 -0.0488692 -0.1457705 -0.0497399 -0.0620372 unknown
polarizability: 201.9586967|-0.3509487|76.9817483|36.224465|24.2082255|124.0161407 unknown
InChI: InChI=1S/C8H12N4O/c1-3-4-9-12-8-10-6(2)5-7(13)11-8/h4-5,10,12H,3H2,1-2H3
charge 0 multiplicity 1
25 atoms
O  -3.321969 -0.616103 -3.003864
N  -0.916962 0.495729 0.110367
N  0.936852 -0.379516 -1.049923
N  -1.167596 -0.520298 -2.062164
N  1.713464 0.01903 0.024782
C  -2.287763 0.774714 0.216117
C  -0.439185 -0.139118 -1.028637
C  -3.107033 0.404203 -0.826472
C  -2.733542 1.462916 1.481717
C  3.887953 0.207824 1.145854
C  -2.581111 -0.27134 -2.03704
C  3.003048 -0.215835 0.001469
C  5.039095 1.137877 0.680943
H  -0.23255 0.735316 0.835569
H  -4.180597 0.601952 -0.786858
H  -2.494654 0.854913 2.375119
H  -3.821379 1.6292 1.462799
H  -2.2383 2.445517 1.601263
H  3.268246 0.709346 1.910321
H  4.325688 -0.694867 1.619753
H  1.302918 -0.853174 -1.886043
H  3.490617 -0.719942 -0.856988
H  4.641487 2.072959 0.248674
H  5.666355 0.646898 -0.086037
H  5.691719 1.400996 1.532376
